Reaction Details
TargetEndothelin-1
LigandBDBM173091
Substrate/Competitorn/a
Meas. Tech.ET-1 Assay
EC50<50000±n/a nM
Citation PubChem, PCBuckman, BONicholas, JBRamphal, JYEmayan, KSeiwert, SD Anti-fibrotic pyridinones US Patent US9675593 Publication Date 6/13/2017
 
Endothelin-1
Name:Endothelin-1
Type:Protein
Mol. Mass.:24444.51
Organism:Homo sapiens (Human)
Description:P05305
Residue:212
BDBM173091
NameBDBM173091
Synonyms:US9675593, 705
TypeSmall organic molecule
Emp. Form.C26H28N4O2
Mol. Mass.428.5261
SMILESCCOc1ccc(c(C)c1)-n1cc(-c2cnn(C)c2)c(cc1=O)N(C)Cc1ccccc1