Reaction Details
TargetReplicase polyprotein 1ab
LigandBDBM484193
Substrate/Competitorn/a
Meas. Tech.Enzyme Inhibition Assay and Ki Values Determination
Ki 24±3.00 nM
Citation Chamakuri, SLu, SUcisik, MNBohren, KMChen, YCDu, HCFaver, JCJimmidi, RLi, FLi, JYNyshadham, PPalmer, SSPollet, JQin, XRonca, SESankaran, BSharma, KLTan, ZVersteeg, LYu, ZMatzuk, MMPalzkill, TYoung, DW DNA-encoded chemistry technology yields expedient access to SARS-CoV-2 M Proc Natl Acad Sci U S A118:0 (2021) 
 
Replicase polyprotein 1ab
Name:Replicase polyprotein 1ab
Type:Protein
Mol. Mass.:794070.71
Organism:2019-nCoV
Description:P0DTD1
Residue:7096
BDBM484193
NameBDBM484193
Synonyms:CDD-1714
TypeSmall organic molecule
Emp. Form.C30H32N4O6
Mol. Mass.544.5983
SMILESCOc1cc(cc(CO)c1OCC(=O)N1CCC(C1)Oc1cccc(c1)C(=O)N(C)C)-c1cccc2[nH]ncc12