Reaction Details
TargetReplicase polyprotein 1ab
LigandBDBM484197
Substrate/Competitorn/a
Meas. Tech.Enzyme Inhibition Assay and Ki Values Determination
Ki 42±5.00 nM
Citation Chamakuri, SLu, SUcisik, MNBohren, KMChen, YCDu, HCFaver, JCJimmidi, RLi, FLi, JYNyshadham, PPalmer, SSPollet, JQin, XRonca, SESankaran, BSharma, KLTan, ZVersteeg, LYu, ZMatzuk, MMPalzkill, TYoung, DW DNA-encoded chemistry technology yields expedient access to SARS-CoV-2 M Proc Natl Acad Sci U S A118:0 (2021) 
 
Replicase polyprotein 1ab
Name:Replicase polyprotein 1ab
Type:Protein
Mol. Mass.:794070.71
Organism:2019-nCoV
Description:P0DTD1
Residue:7096
BDBM484197
NameBDBM484197
Synonyms:CDD-1976 | WO2023004291, Compound CDD-1976
TypeSmall organic molecule
Emp. Form.C18H17N3O3
Mol. Mass.323.3459
SMILESCN(C)C(=O)COc1ccc(cc1C=O)-c1cccc2[nH]ncc12