Reaction Details
TargetReplicase polyprotein 1ab
LigandBDBM484198
Substrate/Competitorn/a
Meas. Tech.Enzyme Inhibition Assay and Ki Values Determination
Ki 2400±230 nM
Citation Chamakuri, SLu, SUcisik, MNBohren, KMChen, YCDu, HCFaver, JCJimmidi, RLi, FLi, JYNyshadham, PPalmer, SSPollet, JQin, XRonca, SESankaran, BSharma, KLTan, ZVersteeg, LYu, ZMatzuk, MMPalzkill, TYoung, DW DNA-encoded chemistry technology yields expedient access to SARS-CoV-2 M Proc Natl Acad Sci U S A118:0 (2021) 
 
Replicase polyprotein 1ab
Name:Replicase polyprotein 1ab
Type:Protein
Mol. Mass.:794070.71
Organism:2019-nCoV
Description:P0DTD1
Residue:7096
BDBM484198
NameBDBM484198
Synonyms:CDD-1777
TypeSmall organic molecule
Emp. Form.C20H24N4O3
Mol. Mass.368.4296
SMILESCNCc1cc(cc(OC)c1OCC(=O)N(C)C)-c1cccc2[nH]ncc12