Reaction Details
TargetStimulator of interferon genes protein
LigandBDBM490774
Substrate/Competitorn/a
Meas. Tech.Radioligand Binding Assay
Ki 4.00±n/a nM
Citation Wythes, MJMcAlpine, IJPatman, RRui, EYMaderna, AJalaie, MGajiwala, KS Cyclopentane-based modulators of STING (stimulator of interferon genes) US Patent US10968242 Publication Date 4/6/2021
 
Stimulator of interferon genes protein
Name:Stimulator of interferon genes protein
Type:Protein
Mol. Mass.:42195.64
Organism:Human
Description:Q86WV6
Residue:379
BDBM490774
NameBDBM490774
Synonyms:US10968242, Example 3 Peak 1
TypeSmall organic molecule
Emp. Form.C20H22FN9O9P2S2
Mol. Mass.677.52
SMILESNc1ncnc2n(cnc12)[C@@H]1O[C@@H]2COP(S)(=O)O[C@@H]3[C@H](O)[C@H](C[C@H]3n3cnc4c3nc[nH]c4=O)OP(S)(=O)O[C@H]2[C@H]1F