Reaction Details
TargetStimulator of interferon genes protein
LigandBDBM490784
Substrate/Competitorn/a
Meas. Tech.Radioligand Binding Assay
Ki 8.00±n/a nM
Citation Wythes, MJMcAlpine, IJPatman, RRui, EYMaderna, AJalaie, MGajiwala, KS Cyclopentane-based modulators of STING (stimulator of interferon genes) US Patent US10968242 Publication Date 4/6/2021
 
Stimulator of interferon genes protein
Name:Stimulator of interferon genes protein
Type:Protein
Mol. Mass.:42195.64
Organism:Human
Description:Q86WV6
Residue:379
BDBM490784
NameBDBM490784
Synonyms:9-[(4S,6R,7S,11aR,13R,14R,14aR,15R)-13-(6-amino-9H-purin-9-yl)-14-fluoro-2,9,15-trihydroxy-2,9-dioxidooctahydro-11H-4,7-methanofuro[3,2-d][1,3,7,9,2,8]tetraoxadiphosphacyclotridecin-6-yl]-1-methyl-1,9-dihydro-6H-purin-6-one | US10968242, Example 14
TypeSmall organic molecule
Emp. Form.C21H24FN9O11P2
Mol. Mass.659.4149
SMILESCn1cnc2n(cnc2c1=O)[C@@H]1C[C@@H]2OP(O)(=O)O[C@@H]3[C@@H](COP(O)(=O)O[C@@H]1[C@@H]2O)O[C@H]([C@@H]3F)n1cnc2c(N)ncnc12