Reaction Details
TargetStimulator of interferon genes protein
LigandBDBM490786
Substrate/Competitorn/a
Meas. Tech.Radioligand Binding Assay
Ki 1.000±n/a nM
Citation Wythes, MJMcAlpine, IJPatman, RRui, EYMaderna, AJalaie, MGajiwala, KS Cyclopentane-based modulators of STING (stimulator of interferon genes) US Patent US10968242 Publication Date 4/6/2021
 
Stimulator of interferon genes protein
Name:Stimulator of interferon genes protein
Type:Protein
Mol. Mass.:42195.64
Organism:Human
Description:Q86WV6
Residue:379
BDBM490786
NameBDBM490786
Synonyms:US10968242, Example 15 Peak 2
TypeSmall organic molecule
Emp. Form.C21H24FN9O10P2S
Mol. Mass.675.48
SMILESCn1cnc2n(cnc2c1=O)[C@@H]1C[C@@H]2OP(O)(=O)O[C@@H]3[C@@H](COP(S)(=O)O[C@@H]1[C@H]2O)O[C@H]([C@@H]3F)n1cnc2c(N)ncnc12