Reaction Details
TargetSodium channel protein type 9 subunit alpha
LigandBDBM258118
Substrate/Competitorn/a
Meas. Tech.Electrophysiological Assay
IC50 45.0±n/a nM
Citation Takahashi, SDomon, YKitano, YShinozuka, T Drugs for treating respiratory diseases US Patent US9597330 Publication Date 3/21/2017
 
Sodium channel protein type 9 subunit alpha
Name:Sodium channel protein type 9 subunit alpha
Type:Protein
Mol. Mass.:226375.97
Organism:Homo sapiens (Human)
Description:Q15858
Residue:1988
BDBM258118
NameBDBM258118
Synonyms:US9493448, 20 US9845313, Example 20
TypeSmall organic molecule
Emp. Form.C19H19ClFN5O3S
Mol. Mass.451.902
SMILESCn1nccc1[C@H]1CCC[C@@H]1Oc1cc(F)c(cc1Cl)S(=O)(=O)Nc1ccncn1