Reaction Details
TargetMaternal embryonic leucine zipper kinase
LigandBDBM50248937
Substrate/Competitorn/a
Ki 84.0±13 nM
Citation Dalby, KNEdupuganti, RTaliaferro, JLee, JH Indolinone derivatives as inhibitors of maternal embryonic leucine zipper kinase US Patent US10981896 Publication Date 4/20/2021
 
Maternal embryonic leucine zipper kinase
Name:Maternal embryonic leucine zipper kinase
Type:Enzyme
Mol. Mass.:74665.45
Organism:Homo sapiens (Human)
Description:Q14680
Residue:651
BDBM50248937
NameBDBM50248937
Synonyms:CHEMBL4062168 | US10981896, Compound 15
TypeSmall organic molecule
Emp. Form.C31H33N5O4
Mol. Mass.539.6248
SMILESCOC(=O)c1ccc2NC(=O)\C(=C(/Nc3ccc(cc3)N(C)C(=O)CN3CCN(C)CC3)c3ccccc3)c2c1