Reaction Details
TargetAdenosine receptor A2a
LigandBDBM50382497
Substrate/Competitorn/a
Meas. Tech.Binding Assay
Ki 2.09±n/a nM
Citation Congreve, MSAndrews, SPMason, JSRichardson, CMBrown, GA 1,2,4-triazine-4-amine derivatives US Patent US10988455 Publication Date 4/27/2021
 
Adenosine receptor A2a
Name:Adenosine receptor A2a
Type:G Protein-Coupled Receptor (GPCR)
Mol. Mass.:44716.46
Organism:Homo sapiens (Human)
Description:P29274
Residue:412
BDBM50382497
NameBDBM50382497
Synonyms:CHEMBL2021950 | US10988455, Example 1(xli)
TypeSmall organic molecule
Emp. Form.C17H16N4O
Mol. Mass.292.3351
SMILESCc1cc(cc(C)c1O)-c1nnc(N)nc1-c1ccccc1