Reaction Details
TargetAdenosine receptor A2a
LigandBDBM50382495
Substrate/Competitorn/a
Meas. Tech.Binding Assay
Ki 10.5±n/a nM
Citation Congreve, MSAndrews, SPMason, JSRichardson, CMBrown, GA 1,2,4-triazine-4-amine derivatives US Patent US10988455 Publication Date 4/27/2021
 
Adenosine receptor A2a
Name:Adenosine receptor A2a
Type:G Protein-Coupled Receptor (GPCR)
Mol. Mass.:44716.46
Organism:Homo sapiens (Human)
Description:P29274
Residue:412
BDBM50382495
NameBDBM50382495
Synonyms:CHEMBL2024118 | US10988455, Example 1(clviii)
TypeSmall organic molecule
Emp. Form.C16H14FN5
Mol. Mass.295.3143
SMILESCc1cc(cc(C)n1)-c1nnc(N)nc1-c1cccc(F)c1