Reaction Details
TargetKetohexokinase
LigandBDBM319583
Substrate/Competitorn/a
Meas. Tech.Biological Assay
IC50 3.60±n/a nM
Citation Dowling, MFernando, DFutatsugi, KHuard, KMagee, TVRaymer, BShavnya, ASmith, AThuma, BTsai, ATu, M Substituted 3-azabicyclo[3.1.0]hexanes as ketohexokinase inhibitors US Patent US10988463 Publication Date 4/27/2021
 
Ketohexokinase
Name:Ketohexokinase
Type:Enzyme Catalytic Domain
Mol. Mass.:32521.64
Organism:Homo sapiens (Human)
Description:n/a
Residue:298
BDBM319583
NameBDBM319583
Synonyms:US10174007, Example 2 US10988463, Example 2 | US11634410, Example 2
TypeSmall organic molecule
Emp. Form.C18H18ClF3N4O3
Mol. Mass.430.809
SMILESC[C@H]1[C@H](O)CN1c1nc(N2C[C@H]3[C@H](CC(O)=O)[C@H]3C2)c(Cl)c(c1C#N)C(F)(F)F