Reaction Details
TargetAcetyl-CoA carboxylase 1
LigandBDBM489782
Substrate/Competitorn/a
Meas. Tech.In Vitro Acetyl-CoA Carboxylase (ACC) Inhibition Assay
IC50<1.000±n/a nM
Citation Zhang, JLiao, HWang, PWang, P Compounds and their uses as ACC inhibitors US Patent US10995099 Publication Date 5/4/2021
 
Acetyl-CoA carboxylase 1
Name:Acetyl-CoA carboxylase 1
Type:Protein
Mol. Mass.:265543.22
Organism:Homo sapiens (Human)
Description:Q13085
Residue:2346
BDBM489782
NameBDBM489782
Synonyms:US10995099, Example 26 | US10995099, Example 37
TypeSmall organic molecule
Emp. Form.C29H31N3O8S
Mol. Mass.581.637
SMILESCOc1ccccc1C(Cn1c2sc(c(C)c2c(=O)n(c1=O)C1(CCC1)C(O)=O)-c1ncco1)OC1CCOCC1