Reaction Details
TargetPoly [ADP-ribose] polymerase 1
LigandBDBM301927
Substrate/Competitorn/a
Meas. Tech.In Vitro Scintillation Proximity Assay (SPA)
IC50 0.933±n/a nM
Citation Angibaud, PRMevellec, LARoux, BStorck, PMeyer, CVialard, JE Tetrahydrophenanthridinones and tetrahydrocyclopentaquinolinones as PARP and tubulin polymerization inhibitors US Patent US9598396 Publication Date 3/21/2017
 
Poly [ADP-ribose] polymerase 1
Name:Poly [ADP-ribose] polymerase 1
Type:n/a
Mol. Mass.:113114.22
Organism:Homo sapiens (Human)
Description:P09874
Residue:1014
BDBM301927
NameBDBM301927
Synonyms:US9598396, Compound 4
TypeSmall organic molecule
Emp. Form.C24H21N3O
Mol. Mass.367.443
SMILESCC(Cc1cccc(c1)C#N)(C#N)c1ccc2c3CCCCc3c(=O)[nH]c2c1