Reaction Details
Target5-hydroxytryptamine receptor 1A
LigandBDBM301963
Substrate/Competitorn/a
Meas. Tech.Binding Affinity Human 5-HT1A Receptor Test
Ki 0.290±n/a nM
Citation Zhang, YJin, CZhou, R Substituted heteroaryl compounds and methods of use thereof US Patent US9598401 Publication Date 3/21/2017
 
5-hydroxytryptamine receptor 1A
Name:5-hydroxytryptamine receptor 1A
Type:n/a
Mol. Mass.:46122.49
Organism:Homo sapiens (Human)
Description:n/a
Residue:422
BDBM301963
NameBDBM301963
Synonyms:3-(3-(4-(4,6-Dimethylpyrimidin-2-yl)piperazin-1-yl)propyl)-5-methoxy-1H-indole | US9598401, Example 17
TypeSmall organic molecule
Emp. Form.C22H29N5O
Mol. Mass.379.4986
SMILESCOc1ccc2[nH]cc(CCCN3CCN(CC3)c3nc(C)cc(C)n3)c2c1