Reaction Details
Target5-hydroxytryptamine receptor 1A
LigandBDBM301964
Substrate/Competitorn/a
Meas. Tech.Binding Affinity Human 5-HT1A Receptor Test
Ki 0.710±n/a nM
Citation Zhang, YJin, CZhou, R Substituted heteroaryl compounds and methods of use thereof US Patent US9598401 Publication Date 3/21/2017
 
5-hydroxytryptamine receptor 1A
Name:5-hydroxytryptamine receptor 1A
Type:n/a
Mol. Mass.:46122.49
Organism:Homo sapiens (Human)
Description:n/a
Residue:422
BDBM301964
NameBDBM301964
Synonyms:5-Chloro-3-(3-(4-(4,6-dimethylpyrimidin-2-yl)piperazin-1-yl)propyl)-1H-indole | US9598401, Example 18
TypeSmall organic molecule
Emp. Form.C21H26ClN5
Mol. Mass.383.918
SMILESCc1cc(C)nc(n1)N1CCN(CCCc2c[nH]c3ccc(Cl)cc23)CC1