Reaction Details
Target5-hydroxytryptamine receptor 1A
LigandBDBM301965
Substrate/Competitorn/a
Meas. Tech.Binding Affinity Human 5-HT1A Receptor Test
Ki 1.40±n/a nM
Citation Zhang, YJin, CZhou, R Substituted heteroaryl compounds and methods of use thereof US Patent US9598401 Publication Date 3/21/2017
 
5-hydroxytryptamine receptor 1A
Name:5-hydroxytryptamine receptor 1A
Type:n/a
Mol. Mass.:46122.49
Organism:Homo sapiens (Human)
Description:n/a
Residue:422
BDBM301965
NameBDBM301965
Synonyms:3-(3-(4-(4,6-Dimethylpyrimidin-2-yl)piperazin-1-yl)propyl)-5-fluoro-1H-indole | US9598401, Example 19
TypeSmall organic molecule
Emp. Form.C21H26FN5
Mol. Mass.367.463
SMILESCc1cc(C)nc(n1)N1CCN(CCCc2c[nH]c3ccc(F)cc23)CC1