Reaction Details
Target5-hydroxytryptamine receptor 1A
LigandBDBM301980
Substrate/Competitorn/a
Meas. Tech.Binding Affinity Human 5-HT1A Receptor Test
Ki 0.200±n/a nM
Citation Zhang, YJin, CZhou, R Substituted heteroaryl compounds and methods of use thereof US Patent US9598401 Publication Date 3/21/2017
 
5-hydroxytryptamine receptor 1A
Name:5-hydroxytryptamine receptor 1A
Type:n/a
Mol. Mass.:46122.49
Organism:Homo sapiens (Human)
Description:n/a
Residue:422
BDBM301980
NameBDBM301980
Synonyms:3-(3-(4-(4-(Trifluoromethyl)pyrimidin-2-yl)piperazin-1-yl)propyl)-1H-indole-5-carbonitrile | US9598401, Example 34
TypeSmall organic molecule
Emp. Form.C21H21F3N6
Mol. Mass.414.4268
SMILESFC(F)(F)c1ccnc(n1)N1CCN(CCCc2c[nH]c3ccc(cc23)[N+]#[C-])CC1