Reaction Details
TargetMitogen-activated protein kinase kinase kinase 5
LigandBDBM503615
Substrate/Competitorn/a
Meas. Tech.Biochemical Assay
Kd<100±n/a nM
Citation Jin, BDong, QHung, G Apoptosis signal-regulating kinase inhibitors and uses thereof US Patent US11034671 Publication Date 6/15/2021
 
Mitogen-activated protein kinase kinase kinase 5
Name:Mitogen-activated protein kinase kinase kinase 5
Type:Protein
Mol. Mass.:154514.93
Organism:Homo sapiens (Human)
Description:Q99683
Residue:1374
BDBM503615
NameBDBM503615
Synonyms:US11034671, Example 2
TypeSmall organic molecule
Emp. Form.C20H21N5O3
Mol. Mass.379.4124
SMILESCOc1ccc2OCCCCCn3cnnc3-c3cccc(NC(=O)c2c1)n3