Reaction Details
TargetMitogen-activated protein kinase kinase kinase 5
LigandBDBM503674
Substrate/Competitorn/a
Meas. Tech.Biochemical Assay
Kd<100±n/a nM
Citation Jin, BDong, QHung, G Apoptosis signal-regulating kinase inhibitors and uses thereof US Patent US11034671 Publication Date 6/15/2021
 
Mitogen-activated protein kinase kinase kinase 5
Name:Mitogen-activated protein kinase kinase kinase 5
Type:Protein
Mol. Mass.:154514.93
Organism:Homo sapiens (Human)
Description:Q99683
Residue:1374
BDBM503674
NameBDBM503674
Synonyms:US11034671, Example 66
TypeSmall organic molecule
Emp. Form.C23H21N7O2
Mol. Mass.427.4585
SMILESO=C1Nc2cccc(n2)-c2nncn2CCCOc2ccc(cc12)-n1cnc(c1)C1CC1