Reaction Details
TargetMitogen-activated protein kinase kinase kinase 5
LigandBDBM503682
Substrate/Competitorn/a
Meas. Tech.Biochemical Assay
Kd<100±n/a nM
Citation Jin, BDong, QHung, G Apoptosis signal-regulating kinase inhibitors and uses thereof US Patent US11034671 Publication Date 6/15/2021
 
Mitogen-activated protein kinase kinase kinase 5
Name:Mitogen-activated protein kinase kinase kinase 5
Type:Protein
Mol. Mass.:154514.93
Organism:Homo sapiens (Human)
Description:Q99683
Residue:1374
BDBM503682
NameBDBM503682
Synonyms:US11034671, Example 74
TypeSmall organic molecule
Emp. Form.C24H21FN6O2
Mol. Mass.444.4609
SMILESCc1ncc(cc1F)-c1ccc2OCCCCn3cnnc3-c3cccc(NC(=O)c2c1)n3