Reaction Details
TargetMitogen-activated protein kinase kinase kinase 5
LigandBDBM503694
Substrate/Competitorn/a
Meas. Tech.Biochemical Assay
Kd<100±n/a nM
Citation Jin, BDong, QHung, G Apoptosis signal-regulating kinase inhibitors and uses thereof US Patent US11034671 Publication Date 6/15/2021
 
Mitogen-activated protein kinase kinase kinase 5
Name:Mitogen-activated protein kinase kinase kinase 5
Type:Protein
Mol. Mass.:154514.93
Organism:Homo sapiens (Human)
Description:Q99683
Residue:1374
BDBM503694
NameBDBM503694
Synonyms:General Procedure for Compounds Example 88 & Example 89 | US11034671, Example 88
TypeSmall organic molecule
Emp. Form.C25H24N6O2
Mol. Mass.440.4971
SMILESC[C@H]1CCCOc2ccc(cc2C(=O)Nc2cccc(n2)-c2nncn12)-c1ccc(C)nc1