Reaction Details
TargetPotassium channel subfamily K member 3
LigandBDBM179659
Substrate/Competitorn/a
Meas. Tech.Activity Assay
IC50 114±n/a nM
Citation Bialy, LLorenz, KWirth, KSteinmeyer, KHessler, GPernerstorfer, JBrendel, J Substituted 4,5,6,7-tetrahydro-1H-pyrazolo[4,3-C]pyridines, their use as medicament, and pharmaceutical preparations comprising them US Patent US9598410 Publication Date 3/21/2017
 
Potassium channel subfamily K member 3
Name:Potassium channel subfamily K member 3
Type:Protein
Mol. Mass.:43534.71
Organism:Homo sapiens (Human)
Description:O14649
Residue:394
BDBM179659
NameBDBM179659
Synonyms:US9127001, 6am | US9598410, Compound 6am
TypeSmall organic molecule
Emp. Form.C23H19F3N4O
Mol. Mass.424.4184
SMILESCC(=O)N1CCc2c(C1)c(nn2Cc1ccc(cc1)C#N)-c1cccc(c1)C(F)(F)F