Reaction Details
TargetPotassium channel subfamily K member 3
LigandBDBM179693
Substrate/Competitorn/a
Meas. Tech.Activity Assay
IC50 19.0±n/a nM
Citation Bialy, LLorenz, KWirth, KSteinmeyer, KHessler, GPernerstorfer, JBrendel, J Substituted 4,5,6,7-tetrahydro-1H-pyrazolo[4,3-C]pyridines, their use as medicament, and pharmaceutical preparations comprising them US Patent US9598410 Publication Date 3/21/2017
 
Potassium channel subfamily K member 3
Name:Potassium channel subfamily K member 3
Type:Protein
Mol. Mass.:43534.71
Organism:Homo sapiens (Human)
Description:O14649
Residue:394
BDBM179693
NameBDBM179693
Synonyms:US9127001, 8b | US9598410, Compound 8b
TypeSmall organic molecule
Emp. Form.C24H22F2N4O
Mol. Mass.420.4545
SMILESCC(C)C(=O)N1CCc2c(C1)c(nn2Cc1ccc(F)cc1F)-c1cccc(c1)C#N