BDBM10096 (3Z)-5-fluoro-4-[(3R)-3-hydroxybut-1-yn-1-yl]-3-[(3-methoxy-1H-pyrrol-2-yl)methylidene]-2,3-dihydro-1H-indol-2-one::4-alkynyl oxindole 7b
SMILES: COc1cc[nH]c1\C=C1/C(=O)Nc2ccc(F)c(C#C[C@@H](C)O)c12
InChI Key: InChIKey=DJEJXDSNSASKPZ-WJEYQPDNSA-N
Data: 1 IC50
PDB links: 1 PDB ID contains this monomer as substructures. 1 PDB ID contains inhibitors having a similarity of 90% to this monomer.
Activity Spreadsheet -- Enzyme Inhibition Constant Data from BindingDB
Found 1 hit for monomerid = 10096
Trg + Lig
Ki
nM
ΔG°
kcal/mole
IC50
nM
Kd
nM
EC50/IC50
nM
koff
s-1
kon
M-1s-1
pHTemp
°C
CDK2/CycE
(Homo sapiens (Human))
BDBM10096
((3Z)-5-fluoro-4-[(3R)-3-hydroxybut-1-yn-1-yl]-3-[(...)
Show SMILES COc1cc[nH]c1\C=C1/C(=O)Nc2ccc(F)c(C#C[C@@H](C)O)c12 |r|
Show InChI InChI=1S/C18H15FN2O3/c1-10(22)3-4-11-13(19)5-6-14-17(11)12(18(23)21-14)9-15-16(24-2)7-8-20-15/h5-10,20,22H,1-2H3,(H,21,23)/b12-9-/t10-/m1/s1
n/an/a 21n/an/an/an/a7.522
Hoffmann-La Roche Inc.
Assay Description
Kinase assays were performed using a recombinant human cyclin E-CDK2 complex. The enzyme was assayed with substrate in the presence of 1uM ATP/[gamma...
Bioorg Med Chem Lett 14: 913-7 (2004)
Article DOI: 10.1016/j.bmcl.2003.12.009
BindingDB Entry DOI: 10.7270/Q20V8B1V