BDBM10104 (3Z)-5-fluoro-4-[(3R)-4-hydroxy-3-[(2-hydroxyethyl)amino]but-1-yn-1-yl]-3-[(3-methoxy-1H-pyrrol-2-yl)methylidene]-2,3-dihydro-1H-indol-2-one::4-alkynyl oxindole 7j
SMILES: COc1cc[nH]c1\C=C1/C(=O)Nc2ccc(F)c(C#C[C@H](CO)NCCO)c12
InChI Key: InChIKey=LICPCHXULHJNTF-XTCQQWIJSA-N
Data: 1 IC50
PDB links: 1 PDB ID contains inhibitors having a similarity of 90% to this monomer.
Activity Spreadsheet -- Enzyme Inhibition Constant Data from BindingDB
Found 1 hit for monomerid = 10104
Trg + Lig
Ki
nM
ΔG°
kcal/mole
IC50
nM
Kd
nM
EC50/IC50
nM
koff
s-1
kon
M-1s-1
pHTemp
°C
CDK2/CycE
(Homo sapiens (Human))
BDBM10104
((3Z)-5-fluoro-4-[(3R)-4-hydroxy-3-[(2-hydroxyethyl...)
Show SMILES COc1cc[nH]c1\C=C1/C(=O)Nc2ccc(F)c(C#C[C@H](CO)NCCO)c12 |r|
Show InChI InChI=1S/C20H20FN3O4/c1-28-18-6-7-23-17(18)10-14-19-13(3-2-12(11-26)22-8-9-25)15(21)4-5-16(19)24-20(14)27/h4-7,10,12,22-23,25-26H,8-9,11H2,1H3,(H,24,27)/b14-10-/t12-/m1/s1
n/an/a 95n/an/an/an/a7.522
Hoffmann-La Roche Inc.
Assay Description
Kinase assays were performed using a recombinant human cyclin E-CDK2 complex. The enzyme was assayed with substrate in the presence of 1uM ATP/[gamma...
Bioorg Med Chem Lett 14: 913-7 (2004)
Article DOI: 10.1016/j.bmcl.2003.12.009
BindingDB Entry DOI: 10.7270/Q20V8B1V