BDBM10106 (3Z)-5-fluoro-4-[(3R,4R)-4-hydroxy-3-(methylamino)pent-1-yn-1-yl]-3-[(3-methoxy-1H-pyrrol-2-yl)methylidene]-2,3-dihydro-1H-indol-2-one::4-alkynyl oxindole 7l
SMILES: CN[C@H](C#Cc1c2\C(=C\c3[nH]ccc3OC)C(=O)Nc2ccc1F)[C@@H](C)O
InChI Key: InChIKey=UYNSEUPNWDBKBJ-HGZHAAGRSA-N
Data: 1 IC50
PDB links: 1 PDB ID contains inhibitors having a similarity of 90% to this monomer.
Activity Spreadsheet -- Enzyme Inhibition Constant Data from BindingDB
Found 1 hit for monomerid = 10106
Trg + Lig
Ki
nM
ΔG°
kcal/mole
IC50
nM
Kd
nM
EC50/IC50
nM
koff
s-1
kon
M-1s-1
pHTemp
°C
CDK2/CycE
(Homo sapiens (Human))
BDBM10106
((3Z)-5-fluoro-4-[(3R,4R)-4-hydroxy-3-(methylamino)...)
Show SMILES CN[C@H](C#Cc1c2\C(=C\c3[nH]ccc3OC)C(=O)Nc2ccc1F)[C@@H](C)O |r|
Show InChI InChI=1S/C20H20FN3O3/c1-11(25)15(22-2)6-4-12-14(21)5-7-16-19(12)13(20(26)24-16)10-17-18(27-3)8-9-23-17/h5,7-11,15,22-23,25H,1-3H3,(H,24,26)/b13-10-/t11-,15-/m1/s1
n/an/a 7n/an/an/an/a7.522
Hoffmann-La Roche Inc.
Assay Description
Kinase assays were performed using a recombinant human cyclin E-CDK2 complex. The enzyme was assayed with substrate in the presence of 1uM ATP/[gamma...
Bioorg Med Chem Lett 14: 913-7 (2004)
Article DOI: 10.1016/j.bmcl.2003.12.009
BindingDB Entry DOI: 10.7270/Q20V8B1V