BDBM102348 US10562854, No. A41::US8536181, A41::US9278930, A41
SMILES: CC(C)(C)OC(=O)N1CCN(Cc2ccn(Cc3ccc(Cl)cc3)c(=O)c2O)CC1
InChI Key: InChIKey=UPJZLOCUUOIMNC-UHFFFAOYSA-N
Data: 10 IC50  1 EC50
Activity Spreadsheet -- Enzyme Inhibition Constant Data from BindingDB
Found 11 hits for monomerid = 102348
Trg + Lig
Ki
nM
ΔG°
kcal/mole
IC50
nM
Kd
nM
EC50/IC50
nM
koff
s-1
kon
M-1s-1
pHTemp
°C
Egl nine homolog 1
(Homo sapiens (Human))
BDBM102348
(US10562854, No. A41 | US8536181, A41 | US9278930, ...)
Show SMILES CC(C)(C)OC(=O)N1CCN(Cc2ccn(Cc3ccc(Cl)cc3)c(=O)c2O)CC1
Show InChI InChI=1S/C22H28ClN3O4/c1-22(2,3)30-21(29)25-12-10-24(11-13-25)15-17-8-9-26(20(28)19(17)27)14-16-4-6-18(23)7-5-16/h4-9,27H,10-15H2,1-3H3
Reactome pathway
US Patent
n/an/a 1.40E+4n/an/an/an/an/an/a
Aerpio Therapeutics Inc.
US Patent
Assay Description
EGLN enzyme activity assay is determined using mass spectrometry (matrix-assisted laser desorption ionization, time-of-flight MS, MALDI-TOF MS.
US Patent US8536181 (2013)
BindingDB Entry DOI: 10.7270/Q2D21W79
Vascular endothelial growth factor A
(Homo sapiens (Human))
BDBM102348
(US10562854, No. A41 | US8536181, A41 | US9278930, ...)
Show SMILES CC(C)(C)OC(=O)N1CCN(Cc2ccn(Cc3ccc(Cl)cc3)c(=O)c2O)CC1
Show InChI InChI=1S/C22H28ClN3O4/c1-22(2,3)30-21(29)25-12-10-24(11-13-25)15-17-8-9-26(20(28)19(17)27)14-16-4-6-18(23)7-5-16/h4-9,27H,10-15H2,1-3H3
Reactome pathway
US Patent
n/an/a 1.66E+4n/an/an/an/an/an/a
Aerpio Therapeutics Inc.
US Patent
Assay Description
ELISA assay using VEGF.
US Patent US8536181 (2013)
BindingDB Entry DOI: 10.7270/Q2D21W79
Egl nine homolog 1
(Homo sapiens (Human))
BDBM102348
(US10562854, No. A41 | US8536181, A41 | US9278930, ...)
Show SMILES CC(C)(C)OC(=O)N1CCN(Cc2ccn(Cc3ccc(Cl)cc3)c(=O)c2O)CC1
Show InChI InChI=1S/C22H28ClN3O4/c1-22(2,3)30-21(29)25-12-10-24(11-13-25)15-17-8-9-26(20(28)19(17)27)14-16-4-6-18(23)7-5-16/h4-9,27H,10-15H2,1-3H3
Reactome pathway
US Patent
n/an/a 1.40E+4n/an/an/an/a7.5n/a
Aerpio Therapeutics Inc.
US Patent
Assay Description
The EGLN-1 (or EGLN-3) enzyme activity is determined using mass spectrometry (matrix-assisted laser desorption ionization, time-of-flight MS, MALDI-T...
US Patent US8778412 (2014)
BindingDB Entry DOI: 10.7270/Q2WS8RZ9
Vascular endothelial growth factor A
(Homo sapiens (Human))
BDBM102348
(US10562854, No. A41 | US8536181, A41 | US9278930, ...)
Show SMILES CC(C)(C)OC(=O)N1CCN(Cc2ccn(Cc3ccc(Cl)cc3)c(=O)c2O)CC1
Show InChI InChI=1S/C22H28ClN3O4/c1-22(2,3)30-21(29)25-12-10-24(11-13-25)15-17-8-9-26(20(28)19(17)27)14-16-4-6-18(23)7-5-16/h4-9,27H,10-15H2,1-3H3
Reactome pathway
US Patent
n/an/a 1.66E+4n/an/an/an/an/an/a
Aerpio Therapeutics Inc.
US Patent
Assay Description
HEK293 cells are seeded in 96-well poly-lysine coated plates at 20,000 cells per well in DMEM (10% FBS, 1% NEAA, 0.1% glutamine). Following overnight...
US Patent US8778412 (2014)
BindingDB Entry DOI: 10.7270/Q2WS8RZ9
Egl nine homolog 1 [179-426]
(Homo sapiens (Human))
BDBM102348
(US10562854, No. A41 | US8536181, A41 | US9278930, ...)
Show SMILES CC(C)(C)OC(=O)N1CCN(Cc2ccn(Cc3ccc(Cl)cc3)c(=O)c2O)CC1
Show InChI InChI=1S/C22H28ClN3O4/c1-22(2,3)30-21(29)25-12-10-24(11-13-25)15-17-8-9-26(20(28)19(17)27)14-16-4-6-18(23)7-5-16/h4-9,27H,10-15H2,1-3H3
US Patent
n/an/a 1.40E+4n/an/an/an/a7.525
AERPIO THERAPEUTICS, INC.
US Patent
Assay Description
The EGLN-1 (or EGLN-3) enzyme activity is determined using mass spectrometry (matrix-assisted laser desorption ionization, time-of-flight MS, MALDI-T...
US Patent US9278930 (2016)
BindingDB Entry DOI: 10.7270/Q24J0CZG
Vascular endothelial growth factor A
(Homo sapiens (Human))
BDBM102348
(US10562854, No. A41 | US8536181, A41 | US9278930, ...)
Show SMILES CC(C)(C)OC(=O)N1CCN(Cc2ccn(Cc3ccc(Cl)cc3)c(=O)c2O)CC1
Show InChI InChI=1S/C22H28ClN3O4/c1-22(2,3)30-21(29)25-12-10-24(11-13-25)15-17-8-9-26(20(28)19(17)27)14-16-4-6-18(23)7-5-16/h4-9,27H,10-15H2,1-3H3
Reactome pathway
US Patent
n/an/a 1.66E+4n/an/an/an/an/an/a
AERPIO THERAPEUTICS, INC.
US Patent
Assay Description
VEGF: HEK293 cells are seeded in 96-well poly-lysine coated plates at 20,000 cells per well in DMEM (10% FBS, 1% NEAA, 0.1% glutamine). Following ove...
US Patent US10562854 (2020)
BindingDB Entry DOI: 10.7270/Q2668GK0
Egl nine homolog 1
(Homo sapiens (Human))
BDBM102348
(US10562854, No. A41 | US8536181, A41 | US9278930, ...)
Show SMILES CC(C)(C)OC(=O)N1CCN(Cc2ccn(Cc3ccc(Cl)cc3)c(=O)c2O)CC1
Show InChI InChI=1S/C22H28ClN3O4/c1-22(2,3)30-21(29)25-12-10-24(11-13-25)15-17-8-9-26(20(28)19(17)27)14-16-4-6-18(23)7-5-16/h4-9,27H,10-15H2,1-3H3
Reactome pathway
n/an/a 1.40E+4n/an/an/an/an/an/a
Janssen Pharmaceutical Research& Development, LLC
Curated by ChEMBL
Assay Description
Inhibition of human recombinant EGLN-1 using DLDLEALAPYIPADDDFQL as substrate after 20 mins by mass spectrophotometric analysis
J Med Chem 56: 9369-402 (2014)
Article DOI: 10.1021/jm400386j
BindingDB Entry DOI: 10.7270/Q290258T
Egl nine homolog 1
(Homo sapiens (Human))
BDBM102348
(US10562854, No. A41 | US8536181, A41 | US9278930, ...)
Show SMILES CC(C)(C)OC(=O)N1CCN(Cc2ccn(Cc3ccc(Cl)cc3)c(=O)c2O)CC1
Show InChI InChI=1S/C22H28ClN3O4/c1-22(2,3)30-21(29)25-12-10-24(11-13-25)15-17-8-9-26(20(28)19(17)27)14-16-4-6-18(23)7-5-16/h4-9,27H,10-15H2,1-3H3
Reactome pathway
n/an/an/an/a 1.70E+4n/an/an/an/a
Janssen Pharmaceutical Research& Development, LLC
Curated by ChEMBL
Assay Description
Inhibition of PHD2 in HEK293 cells assessed as VEGF release by immunoassay
J Med Chem 56: 9369-402 (2014)
Article DOI: 10.1021/jm400386j
BindingDB Entry DOI: 10.7270/Q290258T
Egl nine homolog 1
(Homo sapiens (Human))
BDBM102348
(US10562854, No. A41 | US8536181, A41 | US9278930, ...)
Show SMILES CC(C)(C)OC(=O)N1CCN(Cc2ccn(Cc3ccc(Cl)cc3)c(=O)c2O)CC1
Show InChI InChI=1S/C22H28ClN3O4/c1-22(2,3)30-21(29)25-12-10-24(11-13-25)15-17-8-9-26(20(28)19(17)27)14-16-4-6-18(23)7-5-16/h4-9,27H,10-15H2,1-3H3
Reactome pathway
n/an/a 1.40E+4n/an/an/an/an/an/a
Cadila Healthcare Limited
Curated by ChEMBL
Assay Description
Inhibition of HIF-PHD2 (unknown origin) expressed in insect Hi5 cells using peptide as substrate
J Med Chem 61: 6964-6982 (2018)
Article DOI: 10.1021/acs.jmedchem.7b01686
BindingDB Entry DOI: 10.7270/Q2H70JC7
Egl nine homolog 1
(Homo sapiens (Human))
BDBM102348
(US10562854, No. A41 | US8536181, A41 | US9278930, ...)
Show SMILES CC(C)(C)OC(=O)N1CCN(Cc2ccn(Cc3ccc(Cl)cc3)c(=O)c2O)CC1
Show InChI InChI=1S/C22H28ClN3O4/c1-22(2,3)30-21(29)25-12-10-24(11-13-25)15-17-8-9-26(20(28)19(17)27)14-16-4-6-18(23)7-5-16/h4-9,27H,10-15H2,1-3H3
Reactome pathway
US Patent
n/an/a 1.40E+4n/an/an/an/an/an/a
AERPIO THERAPEUTICS, INC.
US Patent
Assay Description
The EGLN-1 (or EGLN-3) enzyme activity is determined using mass spectrometry (matrix-assisted laser desorption ionization, time-of-flight MS, MALDI-T...
US Patent US10562854 (2020)
BindingDB Entry DOI: 10.7270/Q2668GK0
Vascular endothelial growth factor A
(Homo sapiens (Human))
BDBM102348
(US10562854, No. A41 | US8536181, A41 | US9278930, ...)
Show SMILES CC(C)(C)OC(=O)N1CCN(Cc2ccn(Cc3ccc(Cl)cc3)c(=O)c2O)CC1
Show InChI InChI=1S/C22H28ClN3O4/c1-22(2,3)30-21(29)25-12-10-24(11-13-25)15-17-8-9-26(20(28)19(17)27)14-16-4-6-18(23)7-5-16/h4-9,27H,10-15H2,1-3H3
Reactome pathway
US Patent
n/an/a 1.66E+4n/an/an/an/an/an/a
AERPIO THERAPEUTICS, INC.
US Patent
Assay Description
HEK293 cells are seeded in 96-well poly-lysine coated plates at 20,000 cells per well in DMEM (10% FBS, 1% NEAA, 0.1% glutamine). Following overnight...
US Patent US9278930 (2016)
BindingDB Entry DOI: 10.7270/Q24J0CZG