BDBM10595 (9E)-7-(7-(1,2,3,4-Tetrahydroacridin-9-ylamino)heptylamino)-9-ethylidene-3-methylbicyclo[3.3.1]non-3-ene-1-carboxylic Acid Methyl Ester::Huperzine A-Tacrine Hybrid 5c::methyl (1S)-9-ethylidene-3-methyl-7-{[7-(1,2,3,4-tetrahydroacridin-9-ylamino)heptyl]amino}bicyclo[3.3.1]non-3-ene-1-carboxylate
SMILES: COC(=O)C12CC(CC(C=C(C)C1)C2=CC)NCCCCCCCNc1c2CCCCc2nc2ccccc12
InChI Key: InChIKey=GXLCMIZDIFTAHJ-AIFPUMKXSA-N
Data: 2 KI
Activity Spreadsheet -- Enzyme Inhibition Constant Data from BindingDB
Found 2 hits for monomerid = 10595
Trg + Lig
Ki
nM
ΔG°
kcal/mole
IC50
nM
Kd
nM
EC50/IC50
nM
koff
s-1
kon
M-1s-1
pHTemp
°C
Acetylcholinesterase
(Homo sapiens (Human))
BDBM10595
((9E)-7-(7-(1,2,3,4-Tetrahydroacridin-9-ylamino)hep...)
Show SMILES COC(=O)C12CC(CC(C=C(C)C1)C2=CC)NCCCCCCCNc1c2CCCCc2nc2ccccc12 |t:9,THB:14:13:9.10.12:7.5.6,11:10:13:7.5.6,16:6:13:9.10.12|
Show InChI InChI=1S/C34H47N3O2/c1-4-29-25-20-24(2)22-34(29,33(38)39-3)23-26(21-25)35-18-12-6-5-7-13-19-36-32-27-14-8-10-16-30(27)37-31-17-11-9-15-28(31)32/h4,8,10,14,16,20,25-26,35H,5-7,9,11-13,15,17-19,21-23H2,1-3H3,(H,36,37)/b29-4+
NCI pathway
Reactome pathway
6.40 -11.2n/an/an/an/an/a8.025
Universita di Siena
Assay Description
The cholinesterase assays were performed using colorimetric method reported by E llman. Inhibition of enzyme activity was measured over a substrate c...
J Med Chem 49: 3421-5 (2006)
Article DOI: 10.1021/jm060257t
BindingDB Entry DOI: 10.7270/Q2WW7FWB
Cholinesterases
(Homo sapiens (Human))
BDBM10595
((9E)-7-(7-(1,2,3,4-Tetrahydroacridin-9-ylamino)hep...)
Show SMILES COC(=O)C12CC(CC(C=C(C)C1)C2=CC)NCCCCCCCNc1c2CCCCc2nc2ccccc12 |t:9,THB:14:13:9.10.12:7.5.6,11:10:13:7.5.6,16:6:13:9.10.12|
Show InChI InChI=1S/C34H47N3O2/c1-4-29-25-20-24(2)22-34(29,33(38)39-3)23-26(21-25)35-18-12-6-5-7-13-19-36-32-27-14-8-10-16-30(27)37-31-17-11-9-15-28(31)32/h4,8,10,14,16,20,25-26,35H,5-7,9,11-13,15,17-19,21-23H2,1-3H3,(H,36,37)/b29-4+
Reactome pathway
19.5 -10.5n/an/an/an/an/a8.025
Universita di Siena
Assay Description
The cholinesterase assays were performed using colorimetric method reported by E llman. Inhibition of enzyme activity was measured over a substrate c...
J Med Chem 49: 3421-5 (2006)
Article DOI: 10.1021/jm060257t
BindingDB Entry DOI: 10.7270/Q2WW7FWB