BDBM109316 US8609666, 36
SMILES: COCCNc1cc(nc2c(nc(nc12)N1CCOCC1)-c1cccc(F)c1O)C(O)=O
InChI Key: InChIKey=FOUMYFSFMZYUNS-UHFFFAOYSA-N
Data: 1 IC50
Activity Spreadsheet -- Enzyme Inhibition Constant Data from BindingDB
Found 1 hit for monomerid = 109316
Trg + Lig
Ki
nM
ΔG°
kcal/mole
IC50
nM
Kd
nM
EC50/IC50
nM
koff
s-1
kon
M-1s-1
pHTemp
°C
Phosphatidylinositol 4,5-bisphosphate 3-kinase catalytic subunit alpha isoform
(Homo sapiens (Human))
BDBM109316
(US8609666, 36)
Show SMILES COCCNc1cc(nc2c(nc(nc12)N1CCOCC1)-c1cccc(F)c1O)C(O)=O
Show InChI InChI=1S/C21H22FN5O5/c1-31-8-5-23-14-11-15(20(29)30)24-18-16(12-3-2-4-13(22)19(12)28)25-21(26-17(14)18)27-6-9-32-10-7-27/h2-4,11,28H,5-10H2,1H3,(H,23,24)(H,29,30)
NCI pathway
Reactome pathway
US Patent
n/an/a 18n/an/an/an/an/an/a
Merck Serono SA
US Patent
Assay Description
The efficacy of compounds of the invention in inhibiting the PI3K induced-lipid phosphorylation may be tested in the following binding assay. The ass...
US Patent US8609666 (2013)
BindingDB Entry DOI: 10.7270/Q26M35G5