null
SMILES: NC(=S)N1N=C(CC1c1ccco1)c1ccc(F)cc1
InChI Key: InChIKey=MAMDYOIVAVDENG-UHFFFAOYSA-N
Activity Spreadsheet -- Enzyme Inhibition Constant Data from BindingDB
Found 2 hits for monomerid = 11009
Trg + Lig
Ki
nM
ΔG°
kcal/mole
IC50
nM
Kd
nM
EC50/IC50
nM
koff
s-1
kon
M-1s-1
pHTemp
°C
Amine oxidase [flavin-containing] A
(Bos taurus)
BDBM11009
(1-thiocarbamoyl-3,5-diaryl-4,5-dihydro-(1H)-pyrazo...)
Show SMILES NC(=S)N1N=C(CC1c1ccco1)c1ccc(F)cc1 |c:4|
Show InChI InChI=1S/C14H12FN3OS/c15-10-5-3-9(4-6-10)11-8-12(13-2-1-7-19-13)18(17-11)14(16)20/h1-7,12H,8H2,(H2,16,20)
Reactome pathway
8 -11.5n/an/an/an/an/a7.438
Universita degli Studi di Roma La Sapienza
Assay Description
MAO A and MAO B activities were determined spectrophotometrically using kynuramine as substrates. Fluorimetric measurements were recorded with a Perk...
J Med Chem 48: 7113-22 (2005)
Article DOI: 10.1021/jm040903t
BindingDB Entry DOI: 10.7270/Q2JH3JDW
Amine oxidase [flavin-containing] B
(Bos taurus)
BDBM11009
(1-thiocarbamoyl-3,5-diaryl-4,5-dihydro-(1H)-pyrazo...)
Show SMILES NC(=S)N1N=C(CC1c1ccco1)c1ccc(F)cc1 |c:4|
Show InChI InChI=1S/C14H12FN3OS/c15-10-5-3-9(4-6-10)11-8-12(13-2-1-7-19-13)18(17-11)14(16)20/h1-7,12H,8H2,(H2,16,20)
Reactome pathway
370 -9.15n/an/an/an/an/a7.438
Universita degli Studi di Roma La Sapienza
Assay Description
MAO A and MAO B activities were determined spectrophotometrically using kynuramine as substrates. Fluorimetric measurements were recorded with a Perk...
J Med Chem 48: 7113-22 (2005)
Article DOI: 10.1021/jm040903t
BindingDB Entry DOI: 10.7270/Q2JH3JDW