null
SMILES: Oc1ccc(C(=O)\C=C\c2ccncc2)c(O)c1
InChI Key: InChIKey=SWWOLTIJLQYLTE-DAFODLJHSA-N
Activity Spreadsheet -- Enzyme Inhibition Constant Data from BindingDB
Found 4 hits for monomerid = 110186
Trg + Lig
Ki
nM
ΔG°
kcal/mole
IC50
nM
Kd
nM
EC50/IC50
nM
koff
s-1
kon
M-1s-1
pHTemp
°C
Calpain-1 catalytic subunit
(Homo sapiens (Human))
BDBM110186
(1-(2,4-Dihydroxyphenyl)-3-(pyridin-4-yl)propenone ...)
Show SMILES Oc1ccc(C(=O)\C=C\c2ccncc2)c(O)c1
Show InChI InChI=1S/C14H11NO3/c16-11-2-3-12(14(18)9-11)13(17)4-1-10-5-7-15-8-6-10/h1-9,16,18H/b4-1+
Reactome pathway
n/an/a>1.00E+5n/an/an/an/a7.525
Ewha Womans University, Seoul 120-750, Republic of Korea.
Assay Description
Inhibition of µ-calpain was assayed in the reaction buffer (50 mM Tris-HCl, 50 mM NaCl, 1 mM EDTA, 1 mM EGTA and 5 mM β-mercaptoethanol, pH...
Bioorg Chem 51: 24-30 (2013)
Article DOI: 10.1016/j.bioorg.2013.09.002
BindingDB Entry DOI: 10.7270/Q2NP233R
Procathepsin L
(Homo sapiens (Human))
BDBM110186
(1-(2,4-Dihydroxyphenyl)-3-(pyridin-4-yl)propenone ...)
Show SMILES Oc1ccc(C(=O)\C=C\c2ccncc2)c(O)c1
Show InChI InChI=1S/C14H11NO3/c16-11-2-3-12(14(18)9-11)13(17)4-1-10-5-7-15-8-6-10/h1-9,16,18H/b4-1+
Reactome pathway
n/an/a 4.44E+4n/an/an/an/a5.537
Ewha Womans University, Seoul 120-750, Republic of Korea.
Assay Description
Inhibition of cathepsin L was assayed in reaction buffer (0.1M NaOAc-HCl, 1 mM EDTA, 0.1% β-mercaptoethanol, pH 5.5) containing 20 µM subst...
Bioorg Chem 51: 24-30 (2013)
Article DOI: 10.1016/j.bioorg.2013.09.002
BindingDB Entry DOI: 10.7270/Q2NP233R
Cathepsin B
(Homo sapiens (Human))
BDBM110186
(1-(2,4-Dihydroxyphenyl)-3-(pyridin-4-yl)propenone ...)
Show SMILES Oc1ccc(C(=O)\C=C\c2ccncc2)c(O)c1
Show InChI InChI=1S/C14H11NO3/c16-11-2-3-12(14(18)9-11)13(17)4-1-10-5-7-15-8-6-10/h1-9,16,18H/b4-1+
Reactome pathway
n/an/a 5.03E+4n/an/an/an/a5.537
Ewha Womans University, Seoul 120-750, Republic of Korea.
Assay Description
Inhibition of cathepsin B was assayed in reaction buffer (50 mM NaOAc-HCl, 2 mM dithiothreitol, 2 mM EDTA, pH 5.5) containing 20 µM substrate an...
Bioorg Chem 51: 24-30 (2013)
Article DOI: 10.1016/j.bioorg.2013.09.002
BindingDB Entry DOI: 10.7270/Q2NP233R
Calpain-2 catalytic subunit
(Homo sapiens (Human))
BDBM110186
(1-(2,4-Dihydroxyphenyl)-3-(pyridin-4-yl)propenone ...)
Show SMILES Oc1ccc(C(=O)\C=C\c2ccncc2)c(O)c1
Show InChI InChI=1S/C14H11NO3/c16-11-2-3-12(14(18)9-11)13(17)4-1-10-5-7-15-8-6-10/h1-9,16,18H/b4-1+
n/an/a>1.00E+5n/an/an/an/a7.525
Ewha Womans University, Seoul 120-750, Republic of Korea.
Assay Description
Inhibition of m-calpain was assayed in the reaction buffer (50 mM Tris-HCl, 100 mM NaCl, 5 mM β-mercaptoethanol, and 1 mM EDTA, pH 7.5) with 50 ...
Bioorg Chem 51: 24-30 (2013)
Article DOI: 10.1016/j.bioorg.2013.09.002
BindingDB Entry DOI: 10.7270/Q2NP233R