BDBM110190 1-(2,4-Dihydroxyphenyl)-3-(furan-2-yl)propenone (10)
SMILES: Oc1ccc(C(=O)\C=C\c2ccco2)c(O)c1
InChI Key: InChIKey=JGFMSPGSNOQPCH-GQCTYLIASA-N
Data: 5 IC50
Activity Spreadsheet -- Enzyme Inhibition Constant Data from BindingDB
Found 5 hits for monomerid = 110190
Trg + Lig
Ki
nM
ΔG°
kcal/mole
IC50
nM
Kd
nM
EC50/IC50
nM
koff
s-1
kon
M-1s-1
pHTemp
°C
Calpain1
(Homo sapiens (Human))
BDBM110190
(1-(2,4-Dihydroxyphenyl)-3-(furan-2-yl)propenone (1...)
Show SMILES Oc1ccc(C(=O)\C=C\c2ccco2)c(O)c1
Show InChI InChI=1S/C13H10O4/c14-9-3-5-11(13(16)8-9)12(15)6-4-10-2-1-7-17-10/h1-8,14,16H/b6-4+
Reactome pathway
n/an/a 8.67E+4n/an/an/an/a7.525
Ewha Womans University, Seoul 120-750, Republic of Korea.
Assay Description
Inhibition of µ-calpain was assayed in the reaction buffer (50 mM Tris-HCl, 50 mM NaCl, 1 mM EDTA, 1 mM EGTA and 5 mM β-mercaptoethanol, pH...
Bioorg Chem 51: 24-30 (2013)
Article DOI: 10.1016/j.bioorg.2013.09.002
BindingDB Entry DOI: 10.7270/Q2NP233R
Calpain-2 (m-Calpain)
(Homo sapiens (Human))
BDBM110190
(1-(2,4-Dihydroxyphenyl)-3-(furan-2-yl)propenone (1...)
Show SMILES Oc1ccc(C(=O)\C=C\c2ccco2)c(O)c1
Show InChI InChI=1S/C13H10O4/c14-9-3-5-11(13(16)8-9)12(15)6-4-10-2-1-7-17-10/h1-8,14,16H/b6-4+
n/an/a 2.54E+4n/an/an/an/a7.525
Ewha Womans University, Seoul 120-750, Republic of Korea.
Assay Description
Inhibition of m-calpain was assayed in the reaction buffer (50 mM Tris-HCl, 100 mM NaCl, 5 mM β-mercaptoethanol, and 1 mM EDTA, pH 7.5) with 50 ...
Bioorg Chem 51: 24-30 (2013)
Article DOI: 10.1016/j.bioorg.2013.09.002
BindingDB Entry DOI: 10.7270/Q2NP233R
Protein-tyrosine phosphatase 1B
(Homo sapiens (Human))
BDBM110190
(1-(2,4-Dihydroxyphenyl)-3-(furan-2-yl)propenone (1...)
Show SMILES Oc1ccc(C(=O)\C=C\c2ccco2)c(O)c1
Show InChI InChI=1S/C13H10O4/c14-9-3-5-11(13(16)8-9)12(15)6-4-10-2-1-7-17-10/h1-8,14,16H/b6-4+
NCI pathway
Reactome pathway
n/an/a 2.49E+3n/an/an/an/an/an/a
Guru Ghasidas Vishwavidyalaya (A Central University)
Curated by ChEMBL
Assay Description
Competitive inhibition of PTP1B (unknown origin) using p-nitrophenyl phosphate as substrate
Eur J Med Chem 92: 839-65 (2015)
Article DOI: 10.1016/j.ejmech.2015.01.051
BindingDB Entry DOI: 10.7270/Q2NZ899Z
Procathepsin L
(Homo sapiens (Human))
BDBM110190
(1-(2,4-Dihydroxyphenyl)-3-(furan-2-yl)propenone (1...)
Show SMILES Oc1ccc(C(=O)\C=C\c2ccco2)c(O)c1
Show InChI InChI=1S/C13H10O4/c14-9-3-5-11(13(16)8-9)12(15)6-4-10-2-1-7-17-10/h1-8,14,16H/b6-4+
Reactome pathway
n/an/a 9.05E+4n/an/an/an/a5.537
Ewha Womans University, Seoul 120-750, Republic of Korea.
Assay Description
Inhibition of cathepsin L was assayed in reaction buffer (0.1M NaOAc-HCl, 1 mM EDTA, 0.1% β-mercaptoethanol, pH 5.5) containing 20 µM subst...
Bioorg Chem 51: 24-30 (2013)
Article DOI: 10.1016/j.bioorg.2013.09.002
BindingDB Entry DOI: 10.7270/Q2NP233R
Cathepsin B
(Homo sapiens (Human))
BDBM110190
(1-(2,4-Dihydroxyphenyl)-3-(furan-2-yl)propenone (1...)
Show SMILES Oc1ccc(C(=O)\C=C\c2ccco2)c(O)c1
Show InChI InChI=1S/C13H10O4/c14-9-3-5-11(13(16)8-9)12(15)6-4-10-2-1-7-17-10/h1-8,14,16H/b6-4+
Reactome pathway
n/an/a 6.06E+4n/an/an/an/a5.537
Ewha Womans University, Seoul 120-750, Republic of Korea.
Assay Description
Inhibition of cathepsin B was assayed in reaction buffer (50 mM NaOAc-HCl, 2 mM dithiothreitol, 2 mM EDTA, pH 5.5) containing 20 µM substrate an...
Bioorg Chem 51: 24-30 (2013)
Article DOI: 10.1016/j.bioorg.2013.09.002
BindingDB Entry DOI: 10.7270/Q2NP233R