BDBM11115 (2S)-1-[(2S)-2-amino-3-phenylpropanoyl]pyrrolidine-2-carbonitrile::4-substituted phenylalanine cyano-(S)-pyrrolidine deriv. 2
SMILES: N[C@@H](Cc1ccccc1)C(=O)N1CCC[C@H]1C#N
InChI Key: InChIKey=YDVBKYKVTWRKIY-STQMWFEESA-N
Data: 1 KI  2 IC50
Activity Spreadsheet -- Enzyme Inhibition Constant Data from BindingDB
Found 3 hits for monomerid = 11115
Trg + Lig
Ki
nM
ΔG°
kcal/mole
IC50
nM
Kd
nM
EC50/IC50
nM
koff
s-1
kon
M-1s-1
pHTemp
°C
Dipeptidyl peptidase 4
(Homo sapiens (Human))
BDBM11115
((2S)-1-[(2S)-2-amino-3-phenylpropanoyl]pyrrolidine...)
Show SMILES N[C@@H](Cc1ccccc1)C(=O)N1CCC[C@H]1C#N |r|
Show InChI InChI=1S/C14H17N3O/c15-10-12-7-4-8-17(12)14(18)13(16)9-11-5-2-1-3-6-11/h1-3,5-6,12-13H,4,7-9,16H2/t12-,13-/m0/s1
Reactome pathway
63 -9.82n/an/an/an/an/a7.425
Johnson & Johnson Pharmaceutical
Assay Description
The progress of DPPIV inhibition by compounds was measured by recording the liberation of free pNA at 405 nm. IC50 was determined from the slope of r...
Bioorg Med Chem Lett 16: 123-8 (2006)
Article DOI: 10.1016/j.bmcl.2005.09.037
BindingDB Entry DOI: 10.7270/Q2S180QJ
Dipeptidyl peptidase VIII
(Homo sapiens (Human))
BDBM11115
((2S)-1-[(2S)-2-amino-3-phenylpropanoyl]pyrrolidine...)
Show SMILES N[C@@H](Cc1ccccc1)C(=O)N1CCC[C@H]1C#N |r|
Show InChI InChI=1S/C14H17N3O/c15-10-12-7-4-8-17(12)14(18)13(16)9-11-5-2-1-3-6-11/h1-3,5-6,12-13H,4,7-9,16H2/t12-,13-/m0/s1
n/an/a 210n/an/an/an/an/an/a
Chinese Academy of Sciences
Curated by ChEMBL
Assay Description
Inhibition of 6xHis-tagged recombinant DPP8 (unknown origin) expressed in baculovirus expression system assessed as hydrolysis of Ala-Pro-aminomethyl...
Bioorg Med Chem 21: 7418-29 (2013)
Article DOI: 10.1016/j.bmc.2013.09.048
BindingDB Entry DOI: 10.7270/Q2WS8VPZ
Dipeptidyl peptidase 9
(Homo sapiens (Human))
BDBM11115
((2S)-1-[(2S)-2-amino-3-phenylpropanoyl]pyrrolidine...)
Show SMILES N[C@@H](Cc1ccccc1)C(=O)N1CCC[C@H]1C#N |r|
Show InChI InChI=1S/C14H17N3O/c15-10-12-7-4-8-17(12)14(18)13(16)9-11-5-2-1-3-6-11/h1-3,5-6,12-13H,4,7-9,16H2/t12-,13-/m0/s1
n/an/a 330n/an/an/an/an/an/a
Chinese Academy of Sciences
Curated by ChEMBL
Assay Description
Inhibition of 6xHis-tagged recombinant DPP9 (unknown origin) expressed in baculovirus expression system assessed as hydrolysis of Ala-Pro-aminomethyl...
Bioorg Med Chem 21: 7418-29 (2013)
Article DOI: 10.1016/j.bmc.2013.09.048
BindingDB Entry DOI: 10.7270/Q2WS8VPZ