BDBM11120 (2S)-1-[(2S)-2-amino-3-[4-(3,4-dimethoxyphenyl)phenyl]propanoyl]pyrrolidine-2-carbonitrile::4-substituted phenylalanine cyano-(S)-pyrrolidine deriv. 7
SMILES: COc1ccc(cc1OC)-c1ccc(C[C@H](N)C(=O)N2CCC[C@H]2C#N)cc1
InChI Key: InChIKey=WWCWJYHHJWZHCY-OALUTQOASA-N
Data: 1 KI
Activity Spreadsheet -- Enzyme Inhibition Constant Data from BindingDB
Found 1 hit for monomerid = 11120
Trg + Lig
Ki
nM
ΔG°
kcal/mole
IC50
nM
Kd
nM
EC50/IC50
nM
koff
s-1
kon
M-1s-1
pHTemp
°C
Dipeptidyl peptidase 4
(Homo sapiens (Human))
BDBM11120
((2S)-1-[(2S)-2-amino-3-[4-(3,4-dimethoxyphenyl)phe...)
Show SMILES COc1ccc(cc1OC)-c1ccc(C[C@H](N)C(=O)N2CCC[C@H]2C#N)cc1 |r|
Show InChI InChI=1S/C22H25N3O3/c1-27-20-10-9-17(13-21(20)28-2)16-7-5-15(6-8-16)12-19(24)22(26)25-11-3-4-18(25)14-23/h5-10,13,18-19H,3-4,11-12,24H2,1-2H3/t18-,19-/m0/s1
Reactome pathway
26 -10.3n/an/an/an/an/a7.425
Johnson & Johnson Pharmaceutical
Assay Description
The progress of DPPIV inhibition by compounds was measured by recording the liberation of free pNA at 405 nm. IC50 was determined from the slope of r...
Bioorg Med Chem Lett 16: 123-8 (2006)
Article DOI: 10.1016/j.bmcl.2005.09.037
BindingDB Entry DOI: 10.7270/Q2S180QJ