BDBM11331 2-[benzyl(4-methoxybenzene)sulfonamido]-N-hydroxyacetamide::CGS 27023A Analog 22::Hydroxamate 12
SMILES: COc1ccc(cc1)S(=O)(=O)N(CC(=O)NO)Cc1ccccc1
InChI Key: InChIKey=QCLOBJCDRHHNCL-UHFFFAOYSA-N
Data: 11 KI  3 IC50
Activity Spreadsheet -- Enzyme Inhibition Constant Data from BindingDB
Found 14 hits for monomerid = 11331
Trg + Lig
Ki
nM
ΔG°
kcal/mole
IC50
nM
Kd
nM
EC50/IC50
nM
koff
s-1
kon
M-1s-1
pHTemp
°C
72 kDa type IV collagenase
(Homo sapiens (Human))
BDBM11331
(2-[benzyl(4-methoxybenzene)sulfonamido]-N-hydroxya...)
Show SMILES COc1ccc(cc1)S(=O)(=O)N(CC(=O)NO)Cc1ccccc1
Show InChI InChI=1S/C16H18N2O5S/c1-23-14-7-9-15(10-8-14)24(21,22)18(12-16(19)17-20)11-13-5-3-2-4-6-13/h2-10,20H,11-12H2,1H3,(H,17,19)
Reactome pathway
18n/an/an/an/an/an/an/an/a
Universita degli Studi
Assay Description
Initial rates for the hydrolysis of the thioester substrate AcProLeuGly-S-LeuLeuGlyOEt, coupled to the reaction with 5,5-dithiobis(2-nitrobenzoic aci...
J Med Chem 43: 3677-87 (2000)
Article DOI: 10.1021/jm000027t
BindingDB Entry DOI: 10.7270/Q2736P45
72 kDa type IV collagenase
(Homo sapiens (Human))
BDBM11331
(2-[benzyl(4-methoxybenzene)sulfonamido]-N-hydroxya...)
Show SMILES COc1ccc(cc1)S(=O)(=O)N(CC(=O)NO)Cc1ccccc1
Show InChI InChI=1S/C16H18N2O5S/c1-23-14-7-9-15(10-8-14)24(21,22)18(12-16(19)17-20)11-13-5-3-2-4-6-13/h2-10,20H,11-12H2,1H3,(H,17,19)
Reactome pathway
18n/an/an/an/an/an/an/an/a
Pomona College
Curated by ChEMBL
Assay Description
Inhibition of MMP2
Bioorg Med Chem 15: 2223-68 (2007)
Article DOI: 10.1016/j.bmc.2007.01.011
BindingDB Entry DOI: 10.7270/Q2571DBD
Collagenase (ChC)
(Clostridium histolyticum)
BDBM11331
(2-[benzyl(4-methoxybenzene)sulfonamido]-N-hydroxya...)
Show SMILES COc1ccc(cc1)S(=O)(=O)N(CC(=O)NO)Cc1ccccc1
Show InChI InChI=1S/C16H18N2O5S/c1-23-14-7-9-15(10-8-14)24(21,22)18(12-16(19)17-20)11-13-5-3-2-4-6-13/h2-10,20H,11-12H2,1H3,(H,17,19)
27n/an/an/an/an/an/an/an/a
Universita degli Studi
Assay Description
The rate of hydrolysis was determined from the change in absorbance at 324 nm using an extinction coefficient, 24700 M-1 cm-1 for FALGPA. Initial vel...
J Med Chem 43: 3677-87 (2000)
Article DOI: 10.1021/jm000027t
BindingDB Entry DOI: 10.7270/Q2736P45
Neutrophil collagenase
(Homo sapiens (Human))
BDBM11331
(2-[benzyl(4-methoxybenzene)sulfonamido]-N-hydroxya...)
Show SMILES COc1ccc(cc1)S(=O)(=O)N(CC(=O)NO)Cc1ccccc1
Show InChI InChI=1S/C16H18N2O5S/c1-23-14-7-9-15(10-8-14)24(21,22)18(12-16(19)17-20)11-13-5-3-2-4-6-13/h2-10,20H,11-12H2,1H3,(H,17,19)
Reactome pathway
31n/an/an/an/an/an/an/an/a
Universita degli Studi
Assay Description
Initial rates for the hydrolysis of the thioester substrate AcProLeuGly-S-LeuLeuGlyOEt, coupled to the reaction with 5,5-dithiobis(2-nitrobenzoic aci...
J Med Chem 43: 3677-87 (2000)
Article DOI: 10.1021/jm000027t
BindingDB Entry DOI: 10.7270/Q2736P45
Matrix metalloproteinase-9
(Homo sapiens (Human))
BDBM11331
(2-[benzyl(4-methoxybenzene)sulfonamido]-N-hydroxya...)
Show SMILES COc1ccc(cc1)S(=O)(=O)N(CC(=O)NO)Cc1ccccc1
Show InChI InChI=1S/C16H18N2O5S/c1-23-14-7-9-15(10-8-14)24(21,22)18(12-16(19)17-20)11-13-5-3-2-4-6-13/h2-10,20H,11-12H2,1H3,(H,17,19)
Reactome pathway
42n/an/an/an/an/an/an/an/a
Universita degli Studi
Assay Description
Initial rates for the hydrolysis of the thioester substrate AcProLeuGly-S-LeuLeuGlyOEt, coupled to the reaction with 5,5-dithiobis(2-nitrobenzoic aci...
J Med Chem 43: 3677-87 (2000)
Article DOI: 10.1021/jm000027t
BindingDB Entry DOI: 10.7270/Q2736P45
Matrix metalloproteinase-9
(Homo sapiens (Human))
BDBM11331
(2-[benzyl(4-methoxybenzene)sulfonamido]-N-hydroxya...)
Show SMILES COc1ccc(cc1)S(=O)(=O)N(CC(=O)NO)Cc1ccccc1
Show InChI InChI=1S/C16H18N2O5S/c1-23-14-7-9-15(10-8-14)24(21,22)18(12-16(19)17-20)11-13-5-3-2-4-6-13/h2-10,20H,11-12H2,1H3,(H,17,19)
Reactome pathway
42n/an/an/an/an/an/an/an/a
Pomona College
Curated by ChEMBL
Assay Description
Inhibition of MMP9
Bioorg Med Chem 15: 2223-68 (2007)
Article DOI: 10.1016/j.bmc.2007.01.011
BindingDB Entry DOI: 10.7270/Q2571DBD
Interstitial collagenase
(Homo sapiens (Human))
BDBM11331
(2-[benzyl(4-methoxybenzene)sulfonamido]-N-hydroxya...)
Show SMILES COc1ccc(cc1)S(=O)(=O)N(CC(=O)NO)Cc1ccccc1
Show InChI InChI=1S/C16H18N2O5S/c1-23-14-7-9-15(10-8-14)24(21,22)18(12-16(19)17-20)11-13-5-3-2-4-6-13/h2-10,20H,11-12H2,1H3,(H,17,19)
Reactome pathway
60n/an/an/an/an/an/an/an/a
Universita degli Studi
Assay Description
Initial rates for the hydrolysis of the thioester substrate AcProLeuGly-S-LeuLeuGlyOEt, coupled to the reaction with 5,5-dithiobis(2-nitrobenzoic aci...
J Med Chem 43: 3677-87 (2000)
Article DOI: 10.1021/jm000027t
BindingDB Entry DOI: 10.7270/Q2736P45
3D
3D Structure (docked)
Stromelysin-1
(Homo sapiens (Human))
BDBM11331
(2-[benzyl(4-methoxybenzene)sulfonamido]-N-hydroxya...)
Show SMILES COc1ccc(cc1)S(=O)(=O)N(CC(=O)NO)Cc1ccccc1
Show InChI InChI=1S/C16H18N2O5S/c1-23-14-7-9-15(10-8-14)24(21,22)18(12-16(19)17-20)11-13-5-3-2-4-6-13/h2-10,20H,11-12H2,1H3,(H,17,19)
Reactome pathway
70 -10.1n/an/an/an/an/a7.537
Novartis Pharmaceuticals
Assay Description
Stromelysin inhibitory activity is based on the hydrolysis of substance P by recombinant human stromelysin to generate a fragment, substance P 7-11, ...
J Med Chem 40: 2525-32 (1997)
Article DOI: 10.1021/jm960871c
BindingDB Entry DOI: 10.7270/Q2MW2FC7
Carbonic anhydrase 2
(Homo sapiens (Human))
BDBM11331
(2-[benzyl(4-methoxybenzene)sulfonamido]-N-hydroxya...)
Show SMILES COc1ccc(cc1)S(=O)(=O)N(CC(=O)NO)Cc1ccccc1
Show InChI InChI=1S/C16H18N2O5S/c1-23-14-7-9-15(10-8-14)24(21,22)18(12-16(19)17-20)11-13-5-3-2-4-6-13/h2-10,20H,11-12H2,1H3,(H,17,19)
Reactome pathway
120n/an/an/an/an/an/an/an/a
Universita degli Studi
Assay Description
Initial rates of 4-nitrophenyl acetate hydrolysis catalyzed by different CA isozymes were monitored spectrophotometrically at 400 nm. A molar absorpt...
J Med Chem 43: 3677-87 (2000)
Article DOI: 10.1021/jm000027t
BindingDB Entry DOI: 10.7270/Q2736P45
Carbonic Anhydrase IV
(Bos taurus (bovine))
BDBM11331
(2-[benzyl(4-methoxybenzene)sulfonamido]-N-hydroxya...)
Show SMILES COc1ccc(cc1)S(=O)(=O)N(CC(=O)NO)Cc1ccccc1
Show InChI InChI=1S/C16H18N2O5S/c1-23-14-7-9-15(10-8-14)24(21,22)18(12-16(19)17-20)11-13-5-3-2-4-6-13/h2-10,20H,11-12H2,1H3,(H,17,19)
Reactome pathway
145n/an/an/an/an/an/an/an/a
Universita degli Studi
Assay Description
Initial rates of 4-nitrophenyl acetate hydrolysis catalyzed by different CA isozymes were monitored spectrophotometrically at 400 nm. A molar absorpt...
J Med Chem 43: 3677-87 (2000)
Article DOI: 10.1021/jm000027t
BindingDB Entry DOI: 10.7270/Q2736P45
Carbonic anhydrase 1
(Homo sapiens (Human))
BDBM11331
(2-[benzyl(4-methoxybenzene)sulfonamido]-N-hydroxya...)
Show SMILES COc1ccc(cc1)S(=O)(=O)N(CC(=O)NO)Cc1ccccc1
Show InChI InChI=1S/C16H18N2O5S/c1-23-14-7-9-15(10-8-14)24(21,22)18(12-16(19)17-20)11-13-5-3-2-4-6-13/h2-10,20H,11-12H2,1H3,(H,17,19)
NCI pathway
Reactome pathway
>200>-9.13n/an/an/an/an/a7.425
Universita degli Studi
Assay Description
Initial rates of 4-nitrophenyl acetate hydrolysis catalyzed by different CA isozymes were monitored spectrophotometrically at 400 nm. A molar absorpt...
J Med Chem 43: 3677-87 (2000)
Article DOI: 10.1021/jm000027t
BindingDB Entry DOI: 10.7270/Q2736P45
Meprin A subunit beta
(Homo sapiens)
BDBM11331
(2-[benzyl(4-methoxybenzene)sulfonamido]-N-hydroxya...)
Show SMILES COc1ccc(cc1)S(=O)(=O)N(CC(=O)NO)Cc1ccccc1
Show InChI InChI=1S/C16H18N2O5S/c1-23-14-7-9-15(10-8-14)24(21,22)18(12-16(19)17-20)11-13-5-3-2-4-6-13/h2-10,20H,11-12H2,1H3,(H,17,19)
n/an/a 4.05E+4n/an/an/an/an/an/a
Fraunhofer Institute for Cell Therapy and Immunology IZI
Curated by ChEMBL
Assay Description
Inhibition of recombinant human meprin beta expressed in yeast using Abz-YVAEAPK(Dnp)G-OH as substrate by fluorescence assay
Bioorg Med Chem Lett 27: 2428-2431 (2017)
Article DOI: 10.1016/j.bmcl.2017.04.012
BindingDB Entry DOI: 10.7270/Q2CR5WH0
Interstitial collagenase
(Homo sapiens (Human))
BDBM11331
(2-[benzyl(4-methoxybenzene)sulfonamido]-N-hydroxya...)
Show SMILES COc1ccc(cc1)S(=O)(=O)N(CC(=O)NO)Cc1ccccc1
Show InChI InChI=1S/C16H18N2O5S/c1-23-14-7-9-15(10-8-14)24(21,22)18(12-16(19)17-20)11-13-5-3-2-4-6-13/h2-10,20H,11-12H2,1H3,(H,17,19)
Reactome pathway
n/an/a 60n/an/an/an/an/an/a
Pomona College
Curated by ChEMBL
Assay Description
Inhibition of MMP1
Bioorg Med Chem 15: 2223-68 (2007)
Article DOI: 10.1016/j.bmc.2007.01.011
BindingDB Entry DOI: 10.7270/Q2571DBD
3D
3D Structure (docked)
Bone morphogenetic protein 1
(Homo sapiens (Human))
BDBM11331
(2-[benzyl(4-methoxybenzene)sulfonamido]-N-hydroxya...)
Show SMILES COc1ccc(cc1)S(=O)(=O)N(CC(=O)NO)Cc1ccccc1
Show InChI InChI=1S/C16H18N2O5S/c1-23-14-7-9-15(10-8-14)24(21,22)18(12-16(19)17-20)11-13-5-3-2-4-6-13/h2-10,20H,11-12H2,1H3,(H,17,19)
Reactome pathway
n/an/a 1.60E+4n/an/an/an/an/an/a
FibroGen Inc.
Curated by ChEMBL
Assay Description
Inhibition of PCP after 1 hr by fluorescence assay
Bioorg Med Chem Lett 22: 7397-401 (2012)
Article DOI: 10.1016/j.bmcl.2012.10.067
BindingDB Entry DOI: 10.7270/Q22808SM