BDBM11335 2-[benzyl(1,1,2,2,3,3,4,4,4-nonafluorobutane)sulfonamido]-N-hydroxypropanamide::Hydroxamate 16
SMILES: CC(N(Cc1ccccc1)S(=O)(=O)C(F)(F)C(F)(F)C(F)(F)C(F)(F)F)C(=O)NO
InChI Key: InChIKey=IWTGCCHOUSDKHV-UHFFFAOYSA-N
Data: 10 KI  1 IC50
Activity Spreadsheet -- Enzyme Inhibition Constant Data from BindingDB
Found 11 hits for monomerid = 11335
Trg + Lig
Ki
nM
ΔG°
kcal/mole
IC50
nM
Kd
nM
EC50/IC50
nM
koff
s-1
kon
M-1s-1
pHTemp
°C
72 kDa type IV collagenase
(Homo sapiens (Human))
BDBM11335
(2-[benzyl(1,1,2,2,3,3,4,4,4-nonafluorobutane)sulfo...)
Show SMILES CC(N(Cc1ccccc1)S(=O)(=O)C(F)(F)C(F)(F)C(F)(F)C(F)(F)F)C(=O)NO
Show InChI InChI=1S/C14H13F9N2O4S/c1-8(10(26)24-27)25(7-9-5-3-2-4-6-9)30(28,29)14(22,23)12(17,18)11(15,16)13(19,20)21/h2-6,8,27H,7H2,1H3,(H,24,26)
Reactome pathway
3.20n/an/an/an/an/an/an/an/a
Universita degli Studi
Assay Description
Initial rates for the hydrolysis of the thioester substrate AcProLeuGly-S-LeuLeuGlyOEt, coupled to the reaction with 5,5-dithiobis(2-nitrobenzoic aci...
J Med Chem 43: 3677-87 (2000)
Article DOI: 10.1021/jm000027t
BindingDB Entry DOI: 10.7270/Q2736P45
72 kDa type IV collagenase
(Homo sapiens (Human))
BDBM11335
(2-[benzyl(1,1,2,2,3,3,4,4,4-nonafluorobutane)sulfo...)
Show SMILES CC(N(Cc1ccccc1)S(=O)(=O)C(F)(F)C(F)(F)C(F)(F)C(F)(F)F)C(=O)NO
Show InChI InChI=1S/C14H13F9N2O4S/c1-8(10(26)24-27)25(7-9-5-3-2-4-6-9)30(28,29)14(22,23)12(17,18)11(15,16)13(19,20)21/h2-6,8,27H,7H2,1H3,(H,24,26)
Reactome pathway
3.20n/an/an/an/an/an/an/an/a
Pomona College
Curated by ChEMBL
Assay Description
Inhibition of MMP2
Bioorg Med Chem 15: 2223-68 (2007)
Article DOI: 10.1016/j.bmc.2007.01.011
BindingDB Entry DOI: 10.7270/Q2571DBD
Matrix metalloproteinase-9
(Homo sapiens (Human))
BDBM11335
(2-[benzyl(1,1,2,2,3,3,4,4,4-nonafluorobutane)sulfo...)
Show SMILES CC(N(Cc1ccccc1)S(=O)(=O)C(F)(F)C(F)(F)C(F)(F)C(F)(F)F)C(=O)NO
Show InChI InChI=1S/C14H13F9N2O4S/c1-8(10(26)24-27)25(7-9-5-3-2-4-6-9)30(28,29)14(22,23)12(17,18)11(15,16)13(19,20)21/h2-6,8,27H,7H2,1H3,(H,24,26)
Reactome pathway
4.30n/an/an/an/an/an/an/an/a
Pomona College
Curated by ChEMBL
Assay Description
Inhibition of MMP9
Bioorg Med Chem 15: 2223-68 (2007)
Article DOI: 10.1016/j.bmc.2007.01.011
BindingDB Entry DOI: 10.7270/Q2571DBD
Matrix metalloproteinase-9
(Homo sapiens (Human))
BDBM11335
(2-[benzyl(1,1,2,2,3,3,4,4,4-nonafluorobutane)sulfo...)
Show SMILES CC(N(Cc1ccccc1)S(=O)(=O)C(F)(F)C(F)(F)C(F)(F)C(F)(F)F)C(=O)NO
Show InChI InChI=1S/C14H13F9N2O4S/c1-8(10(26)24-27)25(7-9-5-3-2-4-6-9)30(28,29)14(22,23)12(17,18)11(15,16)13(19,20)21/h2-6,8,27H,7H2,1H3,(H,24,26)
Reactome pathway
4.30n/an/an/an/an/an/an/an/a
Universita degli Studi
Assay Description
Initial rates for the hydrolysis of the thioester substrate AcProLeuGly-S-LeuLeuGlyOEt, coupled to the reaction with 5,5-dithiobis(2-nitrobenzoic aci...
J Med Chem 43: 3677-87 (2000)
Article DOI: 10.1021/jm000027t
BindingDB Entry DOI: 10.7270/Q2736P45
Neutrophil collagenase
(Homo sapiens (Human))
BDBM11335
(2-[benzyl(1,1,2,2,3,3,4,4,4-nonafluorobutane)sulfo...)
Show SMILES CC(N(Cc1ccccc1)S(=O)(=O)C(F)(F)C(F)(F)C(F)(F)C(F)(F)F)C(=O)NO
Show InChI InChI=1S/C14H13F9N2O4S/c1-8(10(26)24-27)25(7-9-5-3-2-4-6-9)30(28,29)14(22,23)12(17,18)11(15,16)13(19,20)21/h2-6,8,27H,7H2,1H3,(H,24,26)
Reactome pathway
4.90n/an/an/an/an/an/an/an/a
Universita degli Studi
Assay Description
Initial rates for the hydrolysis of the thioester substrate AcProLeuGly-S-LeuLeuGlyOEt, coupled to the reaction with 5,5-dithiobis(2-nitrobenzoic aci...
J Med Chem 43: 3677-87 (2000)
Article DOI: 10.1021/jm000027t
BindingDB Entry DOI: 10.7270/Q2736P45
Collagenase (ChC)
(Clostridium histolyticum)
BDBM11335
(2-[benzyl(1,1,2,2,3,3,4,4,4-nonafluorobutane)sulfo...)
Show SMILES CC(N(Cc1ccccc1)S(=O)(=O)C(F)(F)C(F)(F)C(F)(F)C(F)(F)F)C(=O)NO
Show InChI InChI=1S/C14H13F9N2O4S/c1-8(10(26)24-27)25(7-9-5-3-2-4-6-9)30(28,29)14(22,23)12(17,18)11(15,16)13(19,20)21/h2-6,8,27H,7H2,1H3,(H,24,26)
12n/an/an/an/an/an/an/an/a
Universita degli Studi
Assay Description
The rate of hydrolysis was determined from the change in absorbance at 324 nm using an extinction coefficient, 24700 M-1 cm-1 for FALGPA. Initial vel...
J Med Chem 43: 3677-87 (2000)
Article DOI: 10.1021/jm000027t
BindingDB Entry DOI: 10.7270/Q2736P45
Interstitial collagenase
(Homo sapiens (Human))
BDBM11335
(2-[benzyl(1,1,2,2,3,3,4,4,4-nonafluorobutane)sulfo...)
Show SMILES CC(N(Cc1ccccc1)S(=O)(=O)C(F)(F)C(F)(F)C(F)(F)C(F)(F)F)C(=O)NO
Show InChI InChI=1S/C14H13F9N2O4S/c1-8(10(26)24-27)25(7-9-5-3-2-4-6-9)30(28,29)14(22,23)12(17,18)11(15,16)13(19,20)21/h2-6,8,27H,7H2,1H3,(H,24,26)
Reactome pathway
26n/an/an/an/an/an/an/an/a
Universita degli Studi
Assay Description
Initial rates for the hydrolysis of the thioester substrate AcProLeuGly-S-LeuLeuGlyOEt, coupled to the reaction with 5,5-dithiobis(2-nitrobenzoic aci...
J Med Chem 43: 3677-87 (2000)
Article DOI: 10.1021/jm000027t
BindingDB Entry DOI: 10.7270/Q2736P45
Carbonic anhydrase 2
(Homo sapiens (Human))
BDBM11335
(2-[benzyl(1,1,2,2,3,3,4,4,4-nonafluorobutane)sulfo...)
Show SMILES CC(N(Cc1ccccc1)S(=O)(=O)C(F)(F)C(F)(F)C(F)(F)C(F)(F)F)C(=O)NO
Show InChI InChI=1S/C14H13F9N2O4S/c1-8(10(26)24-27)25(7-9-5-3-2-4-6-9)30(28,29)14(22,23)12(17,18)11(15,16)13(19,20)21/h2-6,8,27H,7H2,1H3,(H,24,26)
Reactome pathway
92n/an/an/an/an/an/an/an/a
Universita degli Studi
Assay Description
Initial rates of 4-nitrophenyl acetate hydrolysis catalyzed by different CA isozymes were monitored spectrophotometrically at 400 nm. A molar absorpt...
J Med Chem 43: 3677-87 (2000)
Article DOI: 10.1021/jm000027t
BindingDB Entry DOI: 10.7270/Q2736P45
Carbonic Anhydrase IV
(Bos taurus (bovine))
BDBM11335
(2-[benzyl(1,1,2,2,3,3,4,4,4-nonafluorobutane)sulfo...)
Show SMILES CC(N(Cc1ccccc1)S(=O)(=O)C(F)(F)C(F)(F)C(F)(F)C(F)(F)F)C(=O)NO
Show InChI InChI=1S/C14H13F9N2O4S/c1-8(10(26)24-27)25(7-9-5-3-2-4-6-9)30(28,29)14(22,23)12(17,18)11(15,16)13(19,20)21/h2-6,8,27H,7H2,1H3,(H,24,26)
Reactome pathway
107n/an/an/an/an/an/an/an/a
Universita degli Studi
Assay Description
Initial rates of 4-nitrophenyl acetate hydrolysis catalyzed by different CA isozymes were monitored spectrophotometrically at 400 nm. A molar absorpt...
J Med Chem 43: 3677-87 (2000)
Article DOI: 10.1021/jm000027t
BindingDB Entry DOI: 10.7270/Q2736P45
Carbonic anhydrase 1
(Homo sapiens (Human))
BDBM11335
(2-[benzyl(1,1,2,2,3,3,4,4,4-nonafluorobutane)sulfo...)
Show SMILES CC(N(Cc1ccccc1)S(=O)(=O)C(F)(F)C(F)(F)C(F)(F)C(F)(F)F)C(=O)NO
Show InChI InChI=1S/C14H13F9N2O4S/c1-8(10(26)24-27)25(7-9-5-3-2-4-6-9)30(28,29)14(22,23)12(17,18)11(15,16)13(19,20)21/h2-6,8,27H,7H2,1H3,(H,24,26)
NCI pathway
Reactome pathway
121 -9.43n/an/an/an/an/a7.425
Universita degli Studi
Assay Description
Initial rates of 4-nitrophenyl acetate hydrolysis catalyzed by different CA isozymes were monitored spectrophotometrically at 400 nm. A molar absorpt...
J Med Chem 43: 3677-87 (2000)
Article DOI: 10.1021/jm000027t
BindingDB Entry DOI: 10.7270/Q2736P45
Interstitial collagenase
(Homo sapiens (Human))
BDBM11335
(2-[benzyl(1,1,2,2,3,3,4,4,4-nonafluorobutane)sulfo...)
Show SMILES CC(N(Cc1ccccc1)S(=O)(=O)C(F)(F)C(F)(F)C(F)(F)C(F)(F)F)C(=O)NO
Show InChI InChI=1S/C14H13F9N2O4S/c1-8(10(26)24-27)25(7-9-5-3-2-4-6-9)30(28,29)14(22,23)12(17,18)11(15,16)13(19,20)21/h2-6,8,27H,7H2,1H3,(H,24,26)
Reactome pathway
n/an/a 26n/an/an/an/an/an/a
Pomona College
Curated by ChEMBL
Assay Description
Inhibition of MMP1
Bioorg Med Chem 15: 2223-68 (2007)
Article DOI: 10.1016/j.bmc.2007.01.011
BindingDB Entry DOI: 10.7270/Q2571DBD