BDBM11340 Hydroxamate 21::N-hydroxy-2-[(4-methoxybenzene)sulfonamido]-3-methylbutanamide
SMILES: COc1ccc(cc1)S(=O)(=O)NC(C(C)C)C(=O)NO
InChI Key: InChIKey=SUEBJDNLBVTIQP-UHFFFAOYSA-N
Data: 8 KI
PDB links: 6 PDB IDs contain this monomer as substructures. 6 PDB IDs contain inhibitors having a similarity of 90% to this monomer.
Activity Spreadsheet -- Enzyme Inhibition Constant Data from BindingDB
Found 8 hits for monomerid = 11340
Trg + Lig
Ki
nM
ΔG°
kcal/mole
IC50
nM
Kd
nM
EC50/IC50
nM
koff
s-1
kon
M-1s-1
pHTemp
°C
Carbonic anhydrase 1
(Homo sapiens (Human))
BDBM11340
(Hydroxamate 21 | N-hydroxy-2-[(4-methoxybenzene)su...)
Show SMILES COc1ccc(cc1)S(=O)(=O)NC(C(C)C)C(=O)NO
Show InChI InChI=1S/C12H18N2O5S/c1-8(2)11(12(15)13-16)14-20(17,18)10-6-4-9(19-3)5-7-10/h4-8,11,14,16H,1-3H3,(H,13,15)
NCI pathway
Reactome pathway
33 -10.2n/an/an/an/an/a7.425
Universita degli Studi
Assay Description
Initial rates of 4-nitrophenyl acetate hydrolysis catalyzed by different CA isozymes were monitored spectrophotometrically at 400 nm. A molar absorpt...
J Med Chem 43: 3677-87 (2000)
Article DOI: 10.1021/jm000027t
BindingDB Entry DOI: 10.7270/Q2736P45
Carbonic Anhydrase IV
(Bos taurus (bovine))
BDBM11340
(Hydroxamate 21 | N-hydroxy-2-[(4-methoxybenzene)su...)
Show SMILES COc1ccc(cc1)S(=O)(=O)NC(C(C)C)C(=O)NO
Show InChI InChI=1S/C12H18N2O5S/c1-8(2)11(12(15)13-16)14-20(17,18)10-6-4-9(19-3)5-7-10/h4-8,11,14,16H,1-3H3,(H,13,15)
Reactome pathway
38n/an/an/an/an/an/an/an/a
Universita degli Studi
Assay Description
Initial rates of 4-nitrophenyl acetate hydrolysis catalyzed by different CA isozymes were monitored spectrophotometrically at 400 nm. A molar absorpt...
J Med Chem 43: 3677-87 (2000)
Article DOI: 10.1021/jm000027t
BindingDB Entry DOI: 10.7270/Q2736P45
Carbonic anhydrase 2
(Homo sapiens (Human))
BDBM11340
(Hydroxamate 21 | N-hydroxy-2-[(4-methoxybenzene)su...)
Show SMILES COc1ccc(cc1)S(=O)(=O)NC(C(C)C)C(=O)NO
Show InChI InChI=1S/C12H18N2O5S/c1-8(2)11(12(15)13-16)14-20(17,18)10-6-4-9(19-3)5-7-10/h4-8,11,14,16H,1-3H3,(H,13,15)
Reactome pathway
39n/an/an/an/an/an/an/an/a
Universita degli Studi
Assay Description
Initial rates of 4-nitrophenyl acetate hydrolysis catalyzed by different CA isozymes were monitored spectrophotometrically at 400 nm. A molar absorpt...
J Med Chem 43: 3677-87 (2000)
Article DOI: 10.1021/jm000027t
BindingDB Entry DOI: 10.7270/Q2736P45
72 kDa type IV collagenase
(Homo sapiens (Human))
BDBM11340
(Hydroxamate 21 | N-hydroxy-2-[(4-methoxybenzene)su...)
Show SMILES COc1ccc(cc1)S(=O)(=O)NC(C(C)C)C(=O)NO
Show InChI InChI=1S/C12H18N2O5S/c1-8(2)11(12(15)13-16)14-20(17,18)10-6-4-9(19-3)5-7-10/h4-8,11,14,16H,1-3H3,(H,13,15)
Reactome pathway
82n/an/an/an/an/an/an/an/a
Universita degli Studi
Assay Description
Initial rates for the hydrolysis of the thioester substrate AcProLeuGly-S-LeuLeuGlyOEt, coupled to the reaction with 5,5-dithiobis(2-nitrobenzoic aci...
J Med Chem 43: 3677-87 (2000)
Article DOI: 10.1021/jm000027t
BindingDB Entry DOI: 10.7270/Q2736P45
Collagenase (ChC)
(Clostridium histolyticum)
BDBM11340
(Hydroxamate 21 | N-hydroxy-2-[(4-methoxybenzene)su...)
Show SMILES COc1ccc(cc1)S(=O)(=O)NC(C(C)C)C(=O)NO
Show InChI InChI=1S/C12H18N2O5S/c1-8(2)11(12(15)13-16)14-20(17,18)10-6-4-9(19-3)5-7-10/h4-8,11,14,16H,1-3H3,(H,13,15)
103n/an/an/an/an/an/an/an/a
Universita degli Studi
Assay Description
The rate of hydrolysis was determined from the change in absorbance at 324 nm using an extinction coefficient, 24700 M-1 cm-1 for FALGPA. Initial vel...
J Med Chem 43: 3677-87 (2000)
Article DOI: 10.1021/jm000027t
BindingDB Entry DOI: 10.7270/Q2736P45
Matrix metalloproteinase-9
(Homo sapiens (Human))
BDBM11340
(Hydroxamate 21 | N-hydroxy-2-[(4-methoxybenzene)su...)
Show SMILES COc1ccc(cc1)S(=O)(=O)NC(C(C)C)C(=O)NO
Show InChI InChI=1S/C12H18N2O5S/c1-8(2)11(12(15)13-16)14-20(17,18)10-6-4-9(19-3)5-7-10/h4-8,11,14,16H,1-3H3,(H,13,15)
Reactome pathway
126n/an/an/an/an/an/an/an/a
Universita degli Studi
Assay Description
Initial rates for the hydrolysis of the thioester substrate AcProLeuGly-S-LeuLeuGlyOEt, coupled to the reaction with 5,5-dithiobis(2-nitrobenzoic aci...
J Med Chem 43: 3677-87 (2000)
Article DOI: 10.1021/jm000027t
BindingDB Entry DOI: 10.7270/Q2736P45
Neutrophil collagenase
(Homo sapiens (Human))
BDBM11340
(Hydroxamate 21 | N-hydroxy-2-[(4-methoxybenzene)su...)
Show SMILES COc1ccc(cc1)S(=O)(=O)NC(C(C)C)C(=O)NO
Show InChI InChI=1S/C12H18N2O5S/c1-8(2)11(12(15)13-16)14-20(17,18)10-6-4-9(19-3)5-7-10/h4-8,11,14,16H,1-3H3,(H,13,15)
Reactome pathway
126n/an/an/an/an/an/an/an/a
Universita degli Studi
Assay Description
Initial rates for the hydrolysis of the thioester substrate AcProLeuGly-S-LeuLeuGlyOEt, coupled to the reaction with 5,5-dithiobis(2-nitrobenzoic aci...
J Med Chem 43: 3677-87 (2000)
Article DOI: 10.1021/jm000027t
BindingDB Entry DOI: 10.7270/Q2736P45
Interstitial collagenase
(Homo sapiens (Human))
BDBM11340
(Hydroxamate 21 | N-hydroxy-2-[(4-methoxybenzene)su...)
Show SMILES COc1ccc(cc1)S(=O)(=O)NC(C(C)C)C(=O)NO
Show InChI InChI=1S/C12H18N2O5S/c1-8(2)11(12(15)13-16)14-20(17,18)10-6-4-9(19-3)5-7-10/h4-8,11,14,16H,1-3H3,(H,13,15)
Reactome pathway
>200n/an/an/an/an/an/an/an/a
Universita degli Studi
Assay Description
Initial rates for the hydrolysis of the thioester substrate AcProLeuGly-S-LeuLeuGlyOEt, coupled to the reaction with 5,5-dithiobis(2-nitrobenzoic aci...
J Med Chem 43: 3677-87 (2000)
Article DOI: 10.1021/jm000027t
BindingDB Entry DOI: 10.7270/Q2736P45