BDBM11430 4-({5-[(4-aminocyclohexyl)amino]-3-cyanopyrazolo[1,5-a]pyrimidin-7-yl}amino)-N,N-dimethylbenzene-1-sulfonamide::pyrazolo[1,5-a]pyrimidine 9c
SMILES: CN(C)S(=O)(=O)c1ccc(Nc2cc(N[C@H]3CC[C@H](N)CC3)nc3c(cnn23)C#N)cc1
InChI Key: InChIKey=VESKGNRSKDNTQM-WKILWMFISA-N
Data: 2 IC50
PDB links: 1 PDB ID contains inhibitors having a similarity of 90% to this monomer.
Activity Spreadsheet -- Enzyme Inhibition Constant Data from BindingDB
Found 2 hits for monomerid = 11430
Trg + Lig
Ki
nM
ΔG°
kcal/mole
IC50
nM
Kd
nM
EC50/IC50
nM
koff
s-1
kon
M-1s-1
pHTemp
°C
Glycogen Synthase Kinase-3, beta
(Rattus norvegicus (rat))
BDBM11430
(4-({5-[(4-aminocyclohexyl)amino]-3-cyanopyrazolo[1...)
Show SMILES CN(C)S(=O)(=O)c1ccc(Nc2cc(N[C@H]3CC[C@H](N)CC3)nc3c(cnn23)C#N)cc1 |r,wU:18.18,wD:15.14,(-8.53,5.48,;-8.53,7.02,;-9.87,7.79,;-7.2,7.79,;-8.29,8.88,;-6.11,8.88,;-5.87,7.02,;-5.87,5.48,;-4.53,4.71,;-3.2,5.48,;-1.87,4.71,;-1.87,3.17,;-3.2,2.4,;-3.2,.86,;-4.53,.09,;-5.87,.86,;-5.87,2.4,;-7.2,3.17,;-8.53,2.4,;-9.87,3.17,;-8.53,.86,;-7.2,.09,;-1.87,.09,;-.53,.86,;.93,.39,;1.84,1.63,;.93,2.88,;-.53,2.4,;1.41,-1.08,;1.81,-2.56,;-3.2,7.02,;-4.53,7.79,)|
Show InChI InChI=1S/C21H26N8O2S/c1-28(2)32(30,31)18-9-7-17(8-10-18)26-20-11-19(25-16-5-3-15(23)4-6-16)27-21-14(12-22)13-24-29(20)21/h7-11,13,15-16,26H,3-6,23H2,1-2H3,(H,25,27)/t15-,16-
Reactome pathway
n/an/a 460n/an/an/an/an/a30
Martin-Luther-University Halle-Wittenberg
Assay Description
In vitro kinase assay using purified GSK-3 beta was incubated at room temperature with substrate, and test compounds in the presence of 10 uM ATP/ [g...
Bioorg Med Chem Lett 15: 823-5 (2005)
Article DOI: 10.1016/j.bmcl.2004.10.091
BindingDB Entry DOI: 10.7270/Q2QZ2853
Cyclin-Dependent Kinase 2 (CDK2)
(Homo sapiens (Human))
BDBM11430
(4-({5-[(4-aminocyclohexyl)amino]-3-cyanopyrazolo[1...)
Show SMILES CN(C)S(=O)(=O)c1ccc(Nc2cc(N[C@H]3CC[C@H](N)CC3)nc3c(cnn23)C#N)cc1 |r,wU:18.18,wD:15.14,(-8.53,5.48,;-8.53,7.02,;-9.87,7.79,;-7.2,7.79,;-8.29,8.88,;-6.11,8.88,;-5.87,7.02,;-5.87,5.48,;-4.53,4.71,;-3.2,5.48,;-1.87,4.71,;-1.87,3.17,;-3.2,2.4,;-3.2,.86,;-4.53,.09,;-5.87,.86,;-5.87,2.4,;-7.2,3.17,;-8.53,2.4,;-9.87,3.17,;-8.53,.86,;-7.2,.09,;-1.87,.09,;-.53,.86,;.93,.39,;1.84,1.63,;.93,2.88,;-.53,2.4,;1.41,-1.08,;1.81,-2.56,;-3.2,7.02,;-4.53,7.79,)|
Show InChI InChI=1S/C21H26N8O2S/c1-28(2)32(30,31)18-9-7-17(8-10-18)26-20-11-19(25-16-5-3-15(23)4-6-16)27-21-14(12-22)13-24-29(20)21/h7-11,13,15-16,26H,3-6,23H2,1-2H3,(H,25,27)/t15-,16-
NCI pathway
Reactome pathway
n/an/a 7n/an/an/an/a7.522
Vernalis (R&D) Ltd
Assay Description
In vitro kinase assay using purified CDK2/Cyclin A was incubated at room temperature with substrate, and test compounds in the presence of 100 uM ATP...
Bioorg Med Chem Lett 15: 863-7 (2005)
Article DOI: 10.1016/j.bmcl.2004.12.073
BindingDB Entry DOI: 10.7270/Q2ZK5DWP
3D
3D Structure (docked)