null
SMILES: CC(=C)C(=O)Oc1ccc(ccc1=O)\N=N\c1ccc(C)cc1
InChI Key: InChIKey=MRYNEXGYUVXVKV-FMQUCBEESA-N
Activity Spreadsheet -- Enzyme Inhibition Constant Data from BindingDB
Found 2 hits for monomerid = 115152
Trg + Lig
Ki
nM
ΔG°
kcal/mole
IC50
nM
Kd
nM
EC50/IC50
nM
koff
s-1
kon
M-1s-1
pHTemp
°C
PC4 and SFRS1-interacting protein
(Homo sapiens (Human))
BDBM115152
(2-methyl-2-propenoic acid [4-(4-methylphenyl)azo-7...)
Show SMILES CC(=C)C(=O)Oc1ccc(ccc1=O)\N=N\c1ccc(C)cc1
Show InChI InChI=1S/C18H16N2O3/c1-12(2)18(22)23-17-11-9-15(8-10-16(17)21)20-19-14-6-4-13(3)5-7-14/h4-11H,1H2,2-3H3/b20-19+
Reactome pathway
PCBioAssay
n/an/a 3.48E+3n/an/an/an/an/an/a
The Scripps Research Institute Molecular Screening Center
Curated by PubChem BioAssay
Assay Description
Source (MLPCN Center Name): The Scripps Research Institute Molecular Screening Center (SRIMSC) Affiliation: Ohio State University Assay Provider: Mam...
PubChem Bioassay (2014)
BindingDB Entry DOI: 10.7270/Q2KD1WKS
PC4 and SFRS1-interacting protein
(Homo sapiens (Human))
BDBM115152
(2-methyl-2-propenoic acid [4-(4-methylphenyl)azo-7...)
Show SMILES CC(=C)C(=O)Oc1ccc(ccc1=O)\N=N\c1ccc(C)cc1
Show InChI InChI=1S/C18H16N2O3/c1-12(2)18(22)23-17-11-9-15(8-10-16(17)21)20-19-14-6-4-13(3)5-7-14/h4-11H,1H2,2-3H3/b20-19+
Reactome pathway
PCBioAssay
n/an/a 1.99E+3n/an/an/an/an/an/a
The Scripps Research Institute Molecular Screening Center
Curated by PubChem BioAssay
Assay Description
Source (MLPCN Center Name): The Scripps Research Institute Molecular Screening Center (SRIMSC) Affiliation: Ohio State University Assay Provider: Mam...
PubChem Bioassay (2014)
BindingDB Entry DOI: 10.7270/Q2Q52N9H