null
SMILES: COC(C1Cc2cc3cc(OC4CC(OC5CC(O)C(O)C(C)O5)C(O)C(C)O4)c(C)c(O)c3c(O)c2C(=O)C1OC1CC(OC2CC(OC3CC(O)C(OC)C(C)O3)C(O)C(C)O2)C(O)C(C)O1)C(=O)C(O)C(C)O
InChI Key: InChIKey=NKGFIFLSQXHQOK-UHFFFAOYSA-N
Activity Spreadsheet -- Enzyme Inhibition Constant Data from BindingDB
Found 2 hits for monomerid = 115153
Trg + Lig
Ki
nM
ΔG°
kcal/mole
IC50
nM
Kd
nM
EC50/IC50
nM
koff
s-1
kon
M-1s-1
pHTemp
°C
PC4 and SFRS1-interacting protein
(Homo sapiens (Human))
BDBM115153
(MLS002703041 | SMR001566849 | Variamycin | cid_999...)
Show SMILES COC(C1Cc2cc3cc(OC4CC(OC5CC(O)C(O)C(C)O5)C(O)C(C)O4)c(C)c(O)c3c(O)c2C(=O)C1OC1CC(OC2CC(OC3CC(O)C(OC)C(C)O3)C(O)C(C)O2)C(O)C(C)O1)C(=O)C(O)C(C)O
Show InChI InChI=1S/C52H76O24/c1-18-30(72-36-15-31(44(59)21(4)68-36)73-34-13-28(54)43(58)20(3)67-34)12-26-10-25-11-27(51(66-9)49(64)42(57)19(2)53)52(48(63)40(25)47(62)39(26)41(18)56)76-38-17-33(46(61)23(6)70-38)75-37-16-32(45(60)22(5)69-37)74-35-14-29(55)50(65-8)24(7)71-35/h10,12,19-24,27-29,31-38,42-46,50-62H,11,13-17H2,1-9H3
Reactome pathway
PCBioAssay
n/an/a 1.55E+4n/an/an/an/an/an/a
The Scripps Research Institute Molecular Screening Center
Curated by PubChem BioAssay
Assay Description
Source (MLPCN Center Name): The Scripps Research Institute Molecular Screening Center (SRIMSC) Affiliation: Ohio State University Assay Provider: Mam...
PubChem Bioassay (2014)
BindingDB Entry DOI: 10.7270/Q2KD1WKS
PC4 and SFRS1-interacting protein
(Homo sapiens (Human))
BDBM115153
(MLS002703041 | SMR001566849 | Variamycin | cid_999...)
Show SMILES COC(C1Cc2cc3cc(OC4CC(OC5CC(O)C(O)C(C)O5)C(O)C(C)O4)c(C)c(O)c3c(O)c2C(=O)C1OC1CC(OC2CC(OC3CC(O)C(OC)C(C)O3)C(O)C(C)O2)C(O)C(C)O1)C(=O)C(O)C(C)O
Show InChI InChI=1S/C52H76O24/c1-18-30(72-36-15-31(44(59)21(4)68-36)73-34-13-28(54)43(58)20(3)67-34)12-26-10-25-11-27(51(66-9)49(64)42(57)19(2)53)52(48(63)40(25)47(62)39(26)41(18)56)76-38-17-33(46(61)23(6)70-38)75-37-16-32(45(60)22(5)69-37)74-35-14-29(55)50(65-8)24(7)71-35/h10,12,19-24,27-29,31-38,42-46,50-62H,11,13-17H2,1-9H3
Reactome pathway
PCBioAssay
n/an/a 3.56E+3n/an/an/an/an/an/a
The Scripps Research Institute Molecular Screening Center
Curated by PubChem BioAssay
Assay Description
Source (MLPCN Center Name): The Scripps Research Institute Molecular Screening Center (SRIMSC) Affiliation: Ohio State University Assay Provider: Mam...
PubChem Bioassay (2014)
BindingDB Entry DOI: 10.7270/Q2Q52N9H