BDBM115661 US8633183, D-36
SMILES: CCc1ncnc(-c2ccc(C(=O)N3CCN(CCO)CC3)c(Cl)c2)c1C#Cc1ccc(N)nc1
InChI Key: InChIKey=AEPOITNLAPHSGR-UHFFFAOYSA-N
Data: 2 IC50
Activity Spreadsheet -- Enzyme Inhibition Constant Data from BindingDB
Found 2 hits for monomerid = 115661
Trg + Lig
Ki
nM
ΔG°
kcal/mole
IC50
nM
Kd
nM
EC50/IC50
nM
koff
s-1
kon
M-1s-1
pHTemp
°C
Phosphatidylinositol 4,5-bisphosphate 3-kinase catalytic subunit alpha isoform
(Homo sapiens (Human))
BDBM115661
(US8633183, D-36)
Show SMILES CCc1ncnc(-c2ccc(C(=O)N3CCN(CCO)CC3)c(Cl)c2)c1C#Cc1ccc(N)nc1
Show InChI InChI=1S/C26H27ClN6O2/c1-2-23-21(6-3-18-4-8-24(28)29-16-18)25(31-17-30-23)19-5-7-20(22(27)15-19)26(35)33-11-9-32(10-12-33)13-14-34/h4-5,7-8,15-17,34H,2,9-14H2,1H3,(H2,28,29)
NCI pathway
Reactome pathway
US Patent
n/an/a 84n/an/an/an/an/an/a
Boehringer Ingelheim International GmbH
US Patent
Assay Description
PI3Kalpha assay described herein provides IC50 values indicating the activity of the compounds inhibiting PI3 kinase alpha activity Inhibition of PI3...
US Patent US8633183 (2014)
BindingDB Entry DOI: 10.7270/Q2SX6BW4
Serine/threonine-protein kinase mTOR
(Homo sapiens (Human))
BDBM115661
(US8633183, D-36)
Show SMILES CCc1ncnc(-c2ccc(C(=O)N3CCN(CCO)CC3)c(Cl)c2)c1C#Cc1ccc(N)nc1
Show InChI InChI=1S/C26H27ClN6O2/c1-2-23-21(6-3-18-4-8-24(28)29-16-18)25(31-17-30-23)19-5-7-20(22(27)15-19)26(35)33-11-9-32(10-12-33)13-14-34/h4-5,7-8,15-17,34H,2,9-14H2,1H3,(H2,28,29)
NCI pathway
Reactome pathway
US Patent
n/an/a 0.600n/an/an/an/an/an/a
Boehringer Ingelheim International GmbH
US Patent
Assay Description
The mTOR kinase TR-FRET assay utilizes a physiologically relevant protein substrate for mTOR (4E-BP1, labeled with an acceptor fluorophore (Green Flu...
US Patent US8633183 (2014)
BindingDB Entry DOI: 10.7270/Q2SX6BW4