BDBM11642 (2S,5R)-1-[(2S)-2-amino-2-cyclopentylacetyl]-5-ethynylpyrrolidine-2-carbonitrile::(2S,5R)-1-[(2S)-2-amino-2-cyclopentylethanoyl]-5-ethynylpyrrolidine-2-carbonitrile::C5-substituted pyrrolidine 16::alkynyl cyanopyrrolidine 1
SMILES: N[C@@H](C1CCCC1)C(=O)N1[C@H](CC[C@H]1C#N)C#C
InChI Key: InChIKey=WLGYZHSSENEZRE-AVGNSLFASA-N
Data: 6 KI
Activity Spreadsheet -- Enzyme Inhibition Constant Data from BindingDB
Found 6 hits for monomerid = 11642
Trg + Lig
Ki
nM
ΔG°
kcal/mole
IC50
nM
Kd
nM
EC50/IC50
nM
koff
s-1
kon
M-1s-1
pHTemp
°C
Dipeptidyl peptidase 4
(Homo sapiens (Human))
BDBM11642
((2S,5R)-1-[(2S)-2-amino-2-cyclopentylacetyl]-5-eth...)
Show SMILES N[C@@H](C1CCCC1)C(=O)N1[C@H](CC[C@H]1C#N)C#C |r|
Show InChI InChI=1S/C14H19N3O/c1-2-11-7-8-12(9-15)17(11)14(18)13(16)10-5-3-4-6-10/h1,10-13H,3-8,16H2/t11-,12-,13-/m0/s1
Reactome pathway
8 -10.9n/an/an/an/an/a7.522
Abbott Laboratories
Assay Description
The DPP activity resulted in the formation of the fluorescent product amidomethylcoumarin (AMC), which was monitored by excitation at 355 nm and meas...
Biochemistry 45: 7474-82 (2006)
Article DOI: 10.1021/bi060184f
BindingDB Entry DOI: 10.7270/Q2P26WCG
Dipeptidyl peptidase 4
(Homo sapiens (Human))
BDBM11642
((2S,5R)-1-[(2S)-2-amino-2-cyclopentylacetyl]-5-eth...)
Show SMILES N[C@@H](C1CCCC1)C(=O)N1[C@H](CC[C@H]1C#N)C#C |r|
Show InChI InChI=1S/C14H19N3O/c1-2-11-7-8-12(9-15)17(11)14(18)13(16)10-5-3-4-6-10/h1,10-13H,3-8,16H2/t11-,12-,13-/m0/s1
Reactome pathway
8 -10.9n/an/an/an/an/a7.522
Abbott Laboratories
Assay Description
The DPP4 activity resulted in the formation of the fluorescent product amidomethylcoumarin (AMC), which was monitored by excitation at 355 nm and mea...
J Med Chem 49: 6416-20 (2006)
Article DOI: 10.1021/jm060777o
BindingDB Entry DOI: 10.7270/Q2M043M1
Dipeptidyl peptidase IV
(Rattus norvegicus (rat))
BDBM11642
((2S,5R)-1-[(2S)-2-amino-2-cyclopentylacetyl]-5-eth...)
Show SMILES N[C@@H](C1CCCC1)C(=O)N1[C@H](CC[C@H]1C#N)C#C |r|
Show InChI InChI=1S/C14H19N3O/c1-2-11-7-8-12(9-15)17(11)14(18)13(16)10-5-3-4-6-10/h1,10-13H,3-8,16H2/t11-,12-,13-/m0/s1
12 -10.7n/an/an/an/an/a7.522
Abbott Laboratories
Assay Description
The DPP activity resulted in the formation of the fluorescent product amidomethylcoumarin (AMC), which was monitored by excitation at 355 nm and meas...
Biochemistry 45: 7474-82 (2006)
Article DOI: 10.1021/bi060184f
BindingDB Entry DOI: 10.7270/Q2P26WCG
Dipeptidyl peptidase VIII
(Homo sapiens (Human))
BDBM11642
((2S,5R)-1-[(2S)-2-amino-2-cyclopentylacetyl]-5-eth...)
Show SMILES N[C@@H](C1CCCC1)C(=O)N1[C@H](CC[C@H]1C#N)C#C |r|
Show InChI InChI=1S/C14H19N3O/c1-2-11-7-8-12(9-15)17(11)14(18)13(16)10-5-3-4-6-10/h1,10-13H,3-8,16H2/t11-,12-,13-/m0/s1
1.77E+4 -6.41n/an/an/an/an/a7.522
Abbott Laboratories
Assay Description
The DPP activity resulted in the formation of the fluorescent product amidomethylcoumarin (AMC), which was monitored by excitation at 355 nm and meas...
Biochemistry 45: 7474-82 (2006)
Article DOI: 10.1021/bi060184f
BindingDB Entry DOI: 10.7270/Q2P26WCG
Dipeptidyl peptidase VIII
(Homo sapiens (Human))
BDBM11642
((2S,5R)-1-[(2S)-2-amino-2-cyclopentylacetyl]-5-eth...)
Show SMILES N[C@@H](C1CCCC1)C(=O)N1[C@H](CC[C@H]1C#N)C#C |r|
Show InChI InChI=1S/C14H19N3O/c1-2-11-7-8-12(9-15)17(11)14(18)13(16)10-5-3-4-6-10/h1,10-13H,3-8,16H2/t11-,12-,13-/m0/s1
1.77E+4n/an/an/an/an/an/an/an/a
Abbott Laboratories
Assay Description
The DPP activity resulted in the formation of the fluorescent product amidomethylcoumarin (AMC), which was monitored by excitation at 355 nm and meas...
J Med Chem 49: 6416-20 (2006)
Article DOI: 10.1021/jm060777o
BindingDB Entry DOI: 10.7270/Q2M043M1
Dipeptidyl peptidase 9
(Homo sapiens (Human))
BDBM11642
((2S,5R)-1-[(2S)-2-amino-2-cyclopentylacetyl]-5-eth...)
Show SMILES N[C@@H](C1CCCC1)C(=O)N1[C@H](CC[C@H]1C#N)C#C |r|
Show InChI InChI=1S/C14H19N3O/c1-2-11-7-8-12(9-15)17(11)14(18)13(16)10-5-3-4-6-10/h1,10-13H,3-8,16H2/t11-,12-,13-/m0/s1
>3.00E+4n/an/an/an/an/an/an/an/a
Abbott Laboratories
Assay Description
The DPP activity resulted in the formation of the fluorescent product amidomethylcoumarin (AMC), which was monitored by excitation at 355 nm and meas...
J Med Chem 49: 6416-20 (2006)
Article DOI: 10.1021/jm060777o
BindingDB Entry DOI: 10.7270/Q2M043M1