BDBM11864 beta-sulfone 7a::tert-Butyl 4-[(Hydroxyamino)carbonyl]-4-{[(4-phenoxyphenyl)sulfonyl]methyl}piperidine-1-carboxylate::tert-butyl 4-(hydroxycarbamoyl)-4-{[(4-phenoxybenzene)sulfonyl]methyl}piperidine-1-carboxylate
SMILES: CC(C)(C)OC(=O)N1CCC(CS(=O)(=O)c2ccc(Oc3ccccc3)cc2)(CC1)C(=O)NO
InChI Key: InChIKey=XXKPJSZGWAMVSD-UHFFFAOYSA-N
Data: 3 KI
Activity Spreadsheet -- Enzyme Inhibition Constant Data from BindingDB
Found 3 hits for monomerid = 11864
Trg + Lig
Ki
nM
ΔG°
kcal/mole
IC50
nM
Kd
nM
EC50/IC50
nM
koff
s-1
kon
M-1s-1
pHTemp
°C
72 kDa type IV collagenase
(Homo sapiens (Human))
BDBM11864
(beta-sulfone 7a | tert-Butyl 4-[(Hydroxyamino)carb...)
Show SMILES CC(C)(C)OC(=O)N1CCC(CS(=O)(=O)c2ccc(Oc3ccccc3)cc2)(CC1)C(=O)NO
Show InChI InChI=1S/C24H30N2O7S/c1-23(2,3)33-22(28)26-15-13-24(14-16-26,21(27)25-29)17-34(30,31)20-11-9-19(10-12-20)32-18-7-5-4-6-8-18/h4-12,29H,13-17H2,1-3H3,(H,25,27)
Reactome pathway
0.200n/an/an/an/an/an/an/an/a
Pfizer
Assay Description
Inhibitors were assayed against purified hMMP-1, hMMP-2, hMMP-3, hMMP-8, hMMP-9, and hMMP-13 using an enzyme assay based on cleavage of the quenched ...
J Med Chem 48: 6713-30 (2005)
Article DOI: 10.1021/jm0500875
BindingDB Entry DOI: 10.7270/Q2N58JMZ
Collagenase 3
(Homo sapiens (Human))
BDBM11864
(beta-sulfone 7a | tert-Butyl 4-[(Hydroxyamino)carb...)
Show SMILES CC(C)(C)OC(=O)N1CCC(CS(=O)(=O)c2ccc(Oc3ccccc3)cc2)(CC1)C(=O)NO
Show InChI InChI=1S/C24H30N2O7S/c1-23(2,3)33-22(28)26-15-13-24(14-16-26,21(27)25-29)17-34(30,31)20-11-9-19(10-12-20)32-18-7-5-4-6-8-18/h4-12,29H,13-17H2,1-3H3,(H,25,27)
NCI pathway
Reactome pathway
0.200n/an/an/an/an/an/an/an/a
Pfizer
Assay Description
Inhibitors were assayed against purified hMMP-1, hMMP-2, hMMP-3, hMMP-8, hMMP-9, and hMMP-13 using an enzyme assay based on cleavage of the quenched ...
J Med Chem 48: 6713-30 (2005)
Article DOI: 10.1021/jm0500875
BindingDB Entry DOI: 10.7270/Q2N58JMZ
Interstitial collagenase
(Homo sapiens (Human))
BDBM11864
(beta-sulfone 7a | tert-Butyl 4-[(Hydroxyamino)carb...)
Show SMILES CC(C)(C)OC(=O)N1CCC(CS(=O)(=O)c2ccc(Oc3ccccc3)cc2)(CC1)C(=O)NO
Show InChI InChI=1S/C24H30N2O7S/c1-23(2,3)33-22(28)26-15-13-24(14-16-26,21(27)25-29)17-34(30,31)20-11-9-19(10-12-20)32-18-7-5-4-6-8-18/h4-12,29H,13-17H2,1-3H3,(H,25,27)
Reactome pathway
475 -8.62n/an/an/an/an/a7.525
Pfizer
Assay Description
Inhibitors were assayed against purified hMMP-1, hMMP-2, hMMP-3, hMMP-8, hMMP-9, and hMMP-13 using an enzyme assay based on cleavage of the quenched ...
J Med Chem 48: 6713-30 (2005)
Article DOI: 10.1021/jm0500875
BindingDB Entry DOI: 10.7270/Q2N58JMZ