BDBM119868 2‐{4‐[(4‐butyl‐1,2,3‐triazol‐1‐yl)methyl]‐2‐ chlorophenoxy}‐5‐chlorophenol (25)
SMILES: CCCCc1cn(Cc2ccc(Oc3ccc(Cl)cc3O)c(Cl)c2)nn1
InChI Key: InChIKey=MOTJANDATSCTLM-UHFFFAOYSA-N
Data: 1 IC50
Activity Spreadsheet -- Enzyme Inhibition Constant Data from BindingDB
Found 1 hit for monomerid = 119868
Trg + Lig
Ki
nM
ΔG°
kcal/mole
IC50
nM
Kd
nM
EC50/IC50
nM
koff
s-1
kon
M-1s-1
pHTemp
°C
Enoyl-acyl carrier reductase
(Toxoplasma gondii)
BDBM119868
(2‐{4‐[(4‐butyl‐1,2,3‐...)
Show SMILES CCCCc1cn(Cc2ccc(Oc3ccc(Cl)cc3O)c(Cl)c2)nn1
Show InChI InChI=1S/C19H19Cl2N3O2/c1-2-3-4-15-12-24(23-22-15)11-13-5-7-18(16(21)9-13)26-19-8-6-14(20)10-17(19)25/h5-10,12,25H,2-4,11H2,1H3
n/an/a 43n/an/an/an/a7.5n/a
Johns Hopkins Bloomberg School of Public Health
Assay Description
The reaction mixture (100 µL) contained 100 µM crotonyl-CoA, 1 µL DMSO (or compounds dissolved in DMSO), 5 nM TgENR, 100 mM sodium/pot...
Biochemistry 52: 9155-66 (2013)
Article DOI: 10.1021/bi400945y
BindingDB Entry DOI: 10.7270/Q2PV6J27