BDBM120822 N-formyl-5-(-3'-chlorophenyl)-3-phenylpyrazoline (1c)
SMILES: Clc1cccc(c1)C1CC(=NN1C=O)c1ccccc1
InChI Key: InChIKey=YBPWKBNENQQDAD-UHFFFAOYSA-N
Data: 2 KI
Activity Spreadsheet -- Enzyme Inhibition Constant Data from BindingDB
Found 2 hits for monomerid = 120822
Trg + Lig
Ki
nM
ΔG°
kcal/mole
IC50
nM
Kd
nM
EC50/IC50
nM
koff
s-1
kon
M-1s-1
pHTemp
°C
Cathepsin B
(Capra hircus (Goat))
BDBM120822
(N-formyl-5-(-3'-chlorophenyl)-3-phenylpyrazoli...)
Show SMILES Clc1cccc(c1)C1CC(=NN1C=O)c1ccccc1 |c:10|
Show InChI InChI=1S/C16H13ClN2O/c17-14-8-4-7-13(9-14)16-10-15(18-19(16)11-20)12-5-2-1-3-6-12/h1-9,11,16H,10H2
0.146 -13.9n/an/an/an/an/a6.037
Kurukshetra University
Assay Description
Enzyme was equilibrated in 0.1 M phosphate buffer, pH 6.0 at 37 °C. All compounds were prepared in DMSO. Various concentrations of compounds we...
Bioorg Chem 57: 43-50 (2014)
Article DOI: 10.1016/j.bioorg.2014.07.012
BindingDB Entry DOI: 10.7270/Q26Q1VXJ
Cathepsin H
(Capra hircus (Goat))
BDBM120822
(N-formyl-5-(-3'-chlorophenyl)-3-phenylpyrazoli...)
Show SMILES Clc1cccc(c1)C1CC(=NN1C=O)c1ccccc1 |c:10|
Show InChI InChI=1S/C16H13ClN2O/c17-14-8-4-7-13(9-14)16-10-15(18-19(16)11-20)12-5-2-1-3-6-12/h1-9,11,16H,10H2
1.30 -12.6n/an/an/an/an/a6.037
Kurukshetra University
Assay Description
Enzyme was equilibrated in 0.1 M phosphate buffer, pH 6.0 at 37 °C. All compounds were prepared in DMSO. Various concentrations of compounds we...
Bioorg Chem 57: 43-50 (2014)
Article DOI: 10.1016/j.bioorg.2014.07.012
BindingDB Entry DOI: 10.7270/Q26Q1VXJ