BDBM12549 6-chloro-N-[(3S)-1-[(2S)-1-(morpholin-4-yl)-1-oxopropan-2-yl]-2-oxopyrrolidin-3-yl]-1,3-benzothiazole-2-sulfonamide::Arylsulfonamide 2a::N-[(3S)-2-oxopyrrolidin-3-yl]sulfonamide, 1q
SMILES: C[C@H](N1CC[C@H](NS(=O)(=O)c2nc3ccc(Cl)cc3s2)C1=O)C(=O)N1CCOCC1
InChI Key: InChIKey=KOOMWRKYGHYHOT-FZMZJTMJSA-N
Data: 2 KI
Activity Spreadsheet -- Enzyme Inhibition Constant Data from BindingDB
Found 2 hits for monomerid = 12549
Trg + Lig
Ki
nM
ΔG°
kcal/mole
IC50
nM
Kd
nM
EC50/IC50
nM
koff
s-1
kon
M-1s-1
pHTemp
°C
Coagulation factor X
(Homo sapiens (Human))
BDBM12549
(6-chloro-N-[(3S)-1-[(2S)-1-(morpholin-4-yl)-1-oxop...)
Show SMILES C[C@H](N1CC[C@H](NS(=O)(=O)c2nc3ccc(Cl)cc3s2)C1=O)C(=O)N1CCOCC1 |r|
Show InChI InChI=1S/C18H21ClN4O5S2/c1-11(16(24)22-6-8-28-9-7-22)23-5-4-14(17(23)25)21-30(26,27)18-20-13-3-2-12(19)10-15(13)29-18/h2-3,10-11,14,21H,4-9H2,1H3/t11-,14-/m0/s1
Reactome pathway
4.16E+3 -7.26n/an/an/an/an/a7.422
GSK
Assay Description
The ability of test compounds to inhibit human fXa in vitro was determined in a fluorescence assay using rhodamime 110, bis-(Boc-L-glycylglycyl-L-arg...
J Med Chem 50: 1546-57 (2007)
Article DOI: 10.1021/jm060870c
BindingDB Entry DOI: 10.7270/Q2F18X06
Coagulation factor X
(Homo sapiens (Human))
BDBM12549
(6-chloro-N-[(3S)-1-[(2S)-1-(morpholin-4-yl)-1-oxop...)
Show SMILES C[C@H](N1CC[C@H](NS(=O)(=O)c2nc3ccc(Cl)cc3s2)C1=O)C(=O)N1CCOCC1 |r|
Show InChI InChI=1S/C18H21ClN4O5S2/c1-11(16(24)22-6-8-28-9-7-22)23-5-4-14(17(23)25)21-30(26,27)18-20-13-3-2-12(19)10-15(13)29-18/h2-3,10-11,14,21H,4-9H2,1H3/t11-,14-/m0/s1
Reactome pathway
4.16E+3 -7.34n/an/an/an/an/a7.825
GlaxoSmithKline
Assay Description
The inhibitory effect of test compound for human fXa was determined by using the chromogenic substrate. The hydrolysis rates of chromogenic substrate...
Bioorg Med Chem Lett 16: 5731-5 (2006)
Article DOI: 10.1016/j.bmcl.2006.08.092
BindingDB Entry DOI: 10.7270/Q27S7M0T