BDBM126669 US8785638, 154
SMILES: CCCC(C(O)=O)c1c(C)nc2sc3CCCCc3c2c1-c1cc2ccccc2o1
InChI Key: InChIKey=AOGVXPGEXFNHFO-UHFFFAOYSA-N
Data: 1 IC50
Activity Spreadsheet -- Enzyme Inhibition Constant Data from BindingDB
Found 1 hit for monomerid = 126669
Trg + Lig
Ki
nM
ΔG°
kcal/mole
IC50
nM
Kd
nM
EC50/IC50
nM
koff
s-1
kon
M-1s-1
pHTemp
°C
Protease
(Human immunodeficiency virus type 1 (HIV-1))
BDBM126669
(US8785638, 154)
Show SMILES CCCC(C(O)=O)c1c(C)nc2sc3CCCCc3c2c1-c1cc2ccccc2o1
Show InChI InChI=1S/C25H25NO3S/c1-3-8-17(25(27)28)21-14(2)26-24-22(16-10-5-7-12-20(16)30-24)23(21)19-13-15-9-4-6-11-18(15)29-19/h4,6,9,11,13,17H,3,5,7-8,10,12H2,1-2H3,(H,27,28)
US Patent
n/an/a 8.12E+3n/an/an/an/a7.44
Katholieke Universiteit Leuven
US Patent
Assay Description
The AlphaScreen assay was performed according to the manufacturer's protocol (Perkin Elmer, Benelux). Reactions were performed in 25 ul final volume ...
US Patent US8785638 (2014)
BindingDB Entry DOI: 10.7270/Q2S18167