BDBM126677 US8785638, 162
SMILES: Cc1ccc(cc1)-c1c(C(CC(C)(C)C)C(O)=O)c(C)nc2sc3CCCCc3c12
InChI Key: InChIKey=UCCFFUAJUGIOTH-UHFFFAOYSA-N
Data: 1 IC50
Activity Spreadsheet -- Enzyme Inhibition Constant Data from BindingDB
Found 1 hit for monomerid = 126677
Trg + Lig
Ki
nM
ΔG°
kcal/mole
IC50
nM
Kd
nM
EC50/IC50
nM
koff
s-1
kon
M-1s-1
pHTemp
°C
Protease
(Human immunodeficiency virus type 1 (HIV-1))
BDBM126677
(US8785638, 162)
Show SMILES Cc1ccc(cc1)-c1c(C(CC(C)(C)C)C(O)=O)c(C)nc2sc3CCCCc3c12
Show InChI InChI=1S/C26H31NO2S/c1-15-10-12-17(13-11-15)22-21(19(25(28)29)14-26(3,4)5)16(2)27-24-23(22)18-8-6-7-9-20(18)30-24/h10-13,19H,6-9,14H2,1-5H3,(H,28,29)
US Patent
n/an/a 1.57E+3n/an/an/an/a7.44
Katholieke Universiteit Leuven
US Patent
Assay Description
The AlphaScreen assay was performed according to the manufacturer's protocol (Perkin Elmer, Benelux). Reactions were performed in 25 ul final volume ...
US Patent US8785638 (2014)
BindingDB Entry DOI: 10.7270/Q2S18167