BDBM128658 US8796244, 247
SMILES: CC(C)Oc1cc(NC(=O)NCC(F)(F)F)cc(c1)-c1cnc2cc(ccn12)-c1nn2cc(C)nc2s1
InChI Key: InChIKey=YYEPRQYYBGHDEV-UHFFFAOYSA-N
Data: 2 IC50
Activity Spreadsheet -- Enzyme Inhibition Constant Data from BindingDB
Found 2 hits for monomerid = 128658
Trg + Lig
Ki
nM
ΔG°
kcal/mole
IC50
nM
Kd
nM
EC50/IC50
nM
koff
s-1
kon
M-1s-1
pHTemp
°C
Vascular endothelial growth factor receptor 2
(Homo sapiens (Human))
BDBM128658
(US8796244, 247)
Show SMILES CC(C)Oc1cc(NC(=O)NCC(F)(F)F)cc(c1)-c1cnc2cc(ccn12)-c1nn2cc(C)nc2s1
Show InChI InChI=1S/C24H22F3N7O2S/c1-13(2)36-18-7-16(6-17(9-18)31-22(35)29-12-24(25,26)27)19-10-28-20-8-15(4-5-33(19)20)21-32-34-11-14(3)30-23(34)37-21/h4-11,13H,12H2,1-3H3,(H2,29,31,35)
NCI pathway
Reactome pathway
US Patent
n/an/a 12n/an/an/an/a8.025
Astex Therapeutics Ltd
US Patent
Assay Description
VEGFR2 (from Upstate), prepared at 2x final concentration, was incubated with test compounds, biotinylated Flt3 substrate (biotin-VASSDNEYFYVDF) (Cel...
US Patent US8796244 (2014)
BindingDB Entry DOI: 10.7270/Q20C4TFP
Fibroblast growth factor receptor 3
(Homo sapiens (Human))
BDBM128658
(US8796244, 247)
Show SMILES CC(C)Oc1cc(NC(=O)NCC(F)(F)F)cc(c1)-c1cnc2cc(ccn12)-c1nn2cc(C)nc2s1
Show InChI InChI=1S/C24H22F3N7O2S/c1-13(2)36-18-7-16(6-17(9-18)31-22(35)29-12-24(25,26)27)19-10-28-20-8-15(4-5-33(19)20)21-32-34-11-14(3)30-23(34)37-21/h4-11,13H,12H2,1-3H3,(H2,29,31,35)
Reactome pathway
US Patent
n/an/a 0.960n/an/an/an/a8.025
Astex Therapeutics Ltd
US Patent
Assay Description
Enzymes (from Upstate) were prepared at 2× final concentration in 1× kinase assay buffer (Table 1). Enzymes were then incubated with test compounds, ...
US Patent US8796244 (2014)
BindingDB Entry DOI: 10.7270/Q20C4TFP